2-Methyl-3-furanthiol

Van Den Dool and Kratz RI, non-polar column, temperature ramp

View large format table.

Column type Active phase I Reference Comment
CapillaryDB-1844.Rochat S., de Saint Laumer J.Y., et al., 200720. m/0.18 mm/0.18 μm, 60. C @ 3. min, 8. K/min, 220. C @ 5. min
CapillaryZB-5866.Ruiz Perez-Cacho, Mahattanatawee, et al., 200730. m/0.32 mm/0.5 μm, He, 7. K/min, 265. C @ 5. min; Tstart: 40. C
CapillaryBPX-5879.Sarrazin E., Shinkaruk S., et al., 200750. m/0.25 mm/1. μm, 45. C @ 10. min, 3. K/min, 250. C @ 20. min
CapillaryCP Sil 8 CB865.Mahadevan and Farmer, 200660. C @ 5. min, 4. K/min, 220. C @ 30. min; Column length: 50. m; Column diameter: 0.32 mm
CapillaryCP Sil 8 CB881.Aliani and Farmer, 200560. C @ 5. min, 4. K/min, 220. C @ 30. min; Column length: 5. m; Column diameter: 0.32 mm
CapillaryHP-5869.Mahattanatawee, Goodner, et al., 200530. m/0.25 mm/0.25 μm, He, 50. C @ 5. min, 4. K/min, 250. C @ 15. min
CapillaryHP-5875.Mahattanatawee, Goodner, et al., 200530. m/0.25 mm/0.25 μm, He, 50. C @ 5. min, 4. K/min, 250. C @ 15. min
CapillaryDB-5MS875.Whetstine, Cadwallader, et al., 200530. m/0.25 mm/0.25 μm, 40. C @ 3. min, 10. K/min, 200. C @ 20. min
CapillaryDB-5873.Avsar, Karagul-Yuceer, et al., 200430. m/0.25 mm/0.25 μm, 40. C @ 5. min, 10. K/min, 200. C @ 15. min
CapillaryDB-5863.Dreher, Rouseff, et al., 200360. m/0.25 mm/0.25 μm, He, 7. K/min; Tstart: 40. C; Tend: 275. C
CapillaryDB-5868.Valim, Rouseff, et al., 200360. m/0.25 mm/0.25 μm, He, 7. K/min; Tstart: 40. C; Tend: 275. C
CapillaryCP Sil 8 CB872.Elmore, Campo, et al., 200260. m/0.25 mm/0.25 μm, He, 40. C @ 2. min, 4. K/min; Tend: 280. C
CapillaryDB-5868.Wu and Cadwallader, 200230. m/0.32 mm/0.25 μm, He, 40. C @ 5. min, 10. K/min, 220. C @ 30. min
CapillaryDB-5869.Wu and Cadwallader, 200230. m/0.32 mm/0.25 μm, He, 40. C @ 5. min, 10. K/min, 220. C @ 30. min
CapillaryBPX-5873.Ames, Guy, et al., 200150. m/0.32 mm/0.5 μm, He, 60. C @ 5. min, 4. K/min, 250. C @ 10. min
CapillaryBPX-5873.Ames, Guy, et al., 200150. m/0.32 mm/0.5 μm, He, 60. C @ 5. min, 4. K/min, 250. C @ 10. min
CapillaryDB-5MS863.Baek, Kim, et al., 200160. m/0.25 mm/0.25 μm, He, 40. C @ 5. min, 3. K/min, 200. C @ 60. min
CapillaryDB-5875.Bezman, Rouseff, et al., 200130. m/0.32 mm/0.5 μm, He, 33. C @ 5. min, 8. K/min, 230. C @ 8. min
CapillaryDB-5875.Bezman, Rouseff, et al., 200130. m/0.32 mm/0.5 μm, He, 33. C @ 5. min, 8. K/min, 230. C @ 8. min
CapillaryDB-5877.Bezman, Rouseff, et al., 200130. m/0.32 mm/0.5 μm, He, 33. C @ 5. min, 8. K/min, 230. C @ 8. min
CapillaryCP Sil 8 CB863.Chevance and Farmer, 199960. C @ 5. min, 4. K/min, 220. C @ 30. min; Column length: 50. m; Column diameter: 0.32 mm
CapillaryBP-5867.Whitfield and Mottram, 1999He, 60. C @ 5. min, 4. K/min; Column length: 50. m; Column diameter: 0.32 mm; Tend: 250. C
CapillaryDB-5870.Madruga and Mottram, 199830. m/0.32 mm/1. μm, 60. C @ 5. min, 4. K/min, 250. C @ 20. min
CapillarySE-30846.Misharina, Golovnya, et al., 199450. m/0.32 mm/0.25 μm, He, 8. K/min; Tstart: 50. C; Tend: 250. C
CapillaryOV-101858.Misharina, Golovnya, et al., 199350. m/0.32 mm/0.5 μm, He, 4. K/min; Tstart: 50. C; Tend: 200. C
CapillaryOV-101849.Misharina, Golovnya, et al., 199250. m/0.31 mm/0.5 μm, He, 4. K/min; Tstart: 50. C; Tend: 250. C
CapillaryOV-101850.Misharina, Aerove, et al., 199150. m/0.32 mm/0.50 μm, He, 2. K/min; Tstart: 50. C; Tend: 250. C
CapillaryDB-1848.Zhang and Ho, 199160. m/0.25 mm/0.25 μm, He, 2. K/min, 220. C @ 10. min; Tstart: 40. C

Van Den Dool and Kratz RI, non-polar column, custom temperature program

View large format table.

Column type Active phase I Reference Comment
CapillaryDB-5860.Escudero, Campo, et al., 2007Program: not specified
CapillarySPB-5869.Majcher and Jelen, 200730. m/0.53 mm/1.5 μm; Program: 40C(1min) => 6C/min => 180C => 20C/min => 280C
CapillaryDB-5849.Moon, Cliff, et al., 200630. m/0.32 mm/0.25 μm, He; Program: 40C(3min) => 3C/min => 180C => 10C/min => 260C(2min)
CapillaryDB-5861.Campo, Ferreira, et al., 2005Program: not specified
CapillaryHP-5882.Carrapiso, Jurado, et al., 200250. m/0.32 mm/1.05 μm; Program: 35C (5min) => 10C/min => 150C => 20C/min => 250C (10min)
CapillaryHP-5882.Carrapiso, Ventanas, et al., 200250. m/0.32 mm/1.05 μm; Program: 35C(5min) => 10C/min => 150C => 20C/min => 250C(10 min)
CapillarySE-54869.Hofmann and Schieberle, 199830. m/0.32 mm/0.25 μm; Program: 35C(2min) => 40C/min => 50C(5min) => 6C/min => 230C(15min)
CapillarySE-54869.Hofmann and Schieberle, 199530. m/0.32 mm/0.25 μm, He; Program: 40C (2min) => 40C/min => 50C (5min) => 6C/min => 230C (15min)
CapillaryDB-5870.Mottram and Whitfield, 1995He; Column length: 50. m; Column diameter: 0.32 mm; Program: 0C => 60C/min => 60C (5min) => 4C/min => 250C

Van Den Dool and Kratz RI, polar column, temperature ramp

View large format table.

Column type Active phase I Reference Comment
CapillaryBP-201341.Sarrazin E., Shinkaruk S., et al., 200750. m/0.22 mm/0.25 μm, 45. C @ 10. min, 3. K/min, 230. C @ 20. min
CapillaryDB-Wax1323.Gurbuz O., Rouseff J.M., et al., 200630. m/0.32 mm/0.5 μm, He, 7. K/min, 265. C @ 5. min; Tstart: 40. C
CapillaryCP-Wax 52CB1305.Mahadevan and Farmer, 200660. C @ 5. min, 4. K/min, 220. C @ 30. min; Column length: 50. m; Column diameter: 0.32 mm
CapillaryCP-Wax 52CB1310.Mahadevan and Farmer, 200660. C @ 5. min, 4. K/min, 220. C @ 30. min; Column length: 50. m; Column diameter: 0.32 mm
CapillaryCP-Wax 52CB1310.Mahadevan and Farmer, 200660. C @ 5. min, 4. K/min, 220. C @ 30. min; Column length: 50. m; Column diameter: 0.32 mm
CapillaryDB-Wax1313.Petka, Ferreira, et al., 200630. m/0.32 mm/0.5 μm, 40. C @ 3. min, 5. K/min, 200. C @ 8. min
CapillaryDB-Wax1305.Varming, Petersen, et al., 200430. m/0.25 mm/0.25 μm, He, 40. C @ 10. min, 6. K/min, 240. C @ 25. min
CapillaryDB-Wax1305.Dreher, Rouseff, et al., 200330. m/0.25 mm/0.5 μm, 7. K/min; Tstart: 40. C; Tend: 275. C
CapillaryDB-Wax1311.Wu and Cadwallader, 200230. m/0.32 mm/1. μm, He, 40. C @ 5. min, 10. K/min, 200. C @ 30. min
CapillaryDB-Wax1310.Wu and Cadwallader, 200230. m/0.53 mm/1. μm, He, 40. C @ 5. min, 10. K/min, 200. C @ 30. min
CapillaryDB-Wax1357.Bezman, Rouseff, et al., 200160. m/0.32 mm/0.25 μm, He, 30. C @ 4. min, 6. K/min, 220. C @ 10. min
CapillaryDB-Wax1357.Bezman, Rouseff, et al., 200160. m/0.32 mm/0.25 μm, He, 30. C @ 4. min, 6. K/min, 220. C @ 10. min
CapillaryDB-Wax1358.Bezman, Rouseff, et al., 200160. m/0.32 mm/0.25 μm, He, 30. C @ 4. min, 6. K/min, 220. C @ 10. min
CapillaryCP-Wax 52CB1314.Chevance and Farmer, 199960. C @ 5. min, 4. K/min, 220. C @ 30. min; Column length: 50. m; Column diameter: 0.32 mm
CapillaryCP-Wax 52CB1321.Chevance and Farmer, 1999, 240. C @ 5. min, 4. K/min, 220. C @ 30. min; Column length: 50. m; Column diameter: 0.32 mm
CapillaryDB-Wax1305.Ruther and Baltes, 199460. m/0.25 mm/0.25 μm, He, 35. C @ 5. min, 2. K/min, 210. C @ 30. min
CapillaryCP-WAX 57CB1292.Whitfield, Mottram, et al., 1988He, 60. C @ 5. min, 4. K/min, 200. C @ 10. min; Column length: 50. m; Column diameter: 0.32 mm
CapillaryCP-WAX 57CB1295.Whitfield, Mottram, et al., 1988He, 60. C @ 5. min, 4. K/min, 200. C @ 10. min; Column length: 50. m; Column diameter: 0.32 mm

Van Den Dool and Kratz RI, polar column, custom temperature program

View large format table.

Column type Active phase I Reference Comment
CapillaryDB-Wax1315.Escudero, Campo, et al., 200730. m/0.32 mm/0.5 μm, H2; Program: 40C(5min) => 4C/min => 100C6C/min => 136C => 3C/min => 220C (10min)
CapillarySupelcowax-101320.Majcher and Jelen, 200730. m/0.25 mm/0.25 μm; Program: 40C(2min) => 40C/min => 60C(2min) => 5C/min => 240C
CapillaryDB-Wax1317.Campo, Ferreira, et al., 200530. m/0.32 mm/0.5 μm, H2; Program: 40C(5min) => 4C/min => 100C => 6C/min => 200C
CapillaryHP-FFAP1335.Carrapiso, Ventanas, et al., 200230. m/0.32 mm/0.25 μm; Program: 35C(5min) => 10C/min => 150C => 20C/min => 250C(10 min)
CapillaryFFAP1319.Jezussek, Juliano, et al., 200230. m/0.25 mm/0.25 μm, He; Program: 40C(1min) => 40C/min => 50C(2min) => 6C/min => 240C
CapillaryFFAP1305.Rhlid, Fleury, et al., 200230. m/0.32 mm/0.25 μm; Program: 50C (2min) => 6C/min => 180C => 10C/min => 240C(10min)
CapillaryFFAP1300.Hofmann and Schieberle, 199830. m/0.32 mm/0.25 μm; Program: 35C(2min) => 40C/min => 60C(5min) => 6C/min => 230C(15min)
CapillaryCP-Wax 52CB1294.Madruga and Mottram, 199850. m/0.32 mm/0.21 μm; Program: 0C(5min) => fast => 60C(5min) => 4C/min => 220C(20min)
CapillaryFFAP1300.Hofmann and Schieberle, 199530. m/0.32 mm/0.25 μm, He; Program: 40C (2min) => 40C/min => 60C (5min) => 6C/min => 230C (15min)
CapillaryFFAP1300.Hofmann and Schieberle, 199530. m/0.32 mm/0.25 μm, He; Program: 40C (2min) => 40C/min => 60C (5min) => 6C/min => 230C (15min)

Normal alkane RI, non-polar column, temperature ramp

View large format table.

Column type Active phase I Reference Comment
CapillaryDB-5870.Shedid, 201030. m/0.25 mm/0.25 μm, Helium, 4. K/min; Tstart: 50. C; Tend: 220. C
CapillaryDB-5 MS878.Chen, Song, et al., 200930. m/0.32 mm/0.25 μm, Helium, 40. C @ 2. min, 6. K/min, 230. C @ 20. min
CapillaryDB-5 MS875.Chen, Song, et al., 200930. m/0.32 mm/0.25 μm, Helium, 40. C @ 2. min, 6. K/min, 250. C @ 20. min
CapillaryDB-5880.Fadel, Mageed, et al., 2006He, 60. C @ 5. min, 4. K/min; Column length: 60. m; Column diameter: 0.32 mm; Tend: 250. C
CapillaryDB-5865.Lin, Rouseff, et al., 200230. m/0.32 mm/0.25 μm, He, 7. K/min; Tstart: 40. C; Tend: 290. C
CapillaryDB-5869.Sanz, Czerny, et al., 200230. m/0.32 mm/0.25 μm, He, 40. C @ 2. min, 6. K/min, 230. C @ 5. min
CapillaryOV-101844.Friedrich, Acree, et al., 20016. K/min; Column length: 15. m; Column diameter: 0.32 mm; Tstart: 35. C; Tend: 250. C
CapillaryDB-5MS871.Lee, Suriyaphan, et al., 200160. m/0.25 mm/0.25 μm, He, 40. C @ 5. min, 2. K/min, 200. C @ 30. min
CapillaryDB-5890.Kotseridis and Baumes, 200030. m/0.32 mm/0.5 μm, H2, 60. C @ 3. min, 3. K/min, 245. C @ 20. min
CapillaryDB-5890.Kotseridis and Baumes, 200030. m/0.32 mm/0.5 μm, H2, 60. C @ 3. min, 3. K/min, 245. C @ 20. min
CapillaryOV-101844.Deibler, Acree, et al., 199810. m/0.25 mm/0.52 μm, Helium, 35. C @ 3. min, 6. K/min; Tend: 225. C
CapillaryUltra 1844.Farkas, Sádecká, et al., 199750. m/0.20 mm/0.33 μm, Helium, 30. C @ 1. min, 1.7 K/min; Tend: 250. C
CapillaryDB-1844.Güntert, Bertram, et al., 199260. m/0.32 mm/0.25 μm, He, 3. K/min; Tstart: 60. C; Tend: 220. C
CapillaryDB-1844.Guntert, Brüning, et al., 199060. m/0.32 mm/0.25 μm, He, 3. K/min; Tstart: 60. C; Tend: 220. C
CapillaryDB-1846.Werkhoff, Bruning, et al., 199060. m/0.32 mm/0.25 μm, 3. K/min; Tstart: 60. C; Tend: 220. C

Normal alkane RI, non-polar column, custom temperature program

View large format table.

Column type Active phase I Reference Comment
CapillaryDB-5890.San-Juan, Petka, et al., 201030. m/0.32 mm/0.50 μm, Hydrogen; Program: 40 0C (5 min) 4 0C/min -> 100 0C 6 0C/min -> 220 0C (20 min)
CapillaryPolydimethyl siloxane869.Xu, He, et al., 2010Program: 40 0C 20 0C/min -> 60 0C (5 min) 4 0C/min -> 250 0C
CapillaryCP-Sil 5 CB844.Bailly, Jerkovic, et al., 200950. m/0.32 mm/1.20 μm, Nitrogen; Program: 36 0C 20 0C/min -> 85 0C 1 0C -> 145 0C 3 0C/min -> 250 0C
CapillaryCP-Sil 5 Cb858.Collin, Nizet, et al., 200850. m/0.32 mm/1.20 μm, Nitrogen; Program: 40 0C 20 0C/min -> 85 0C 1 0C/min -> 145 0C 3 0C/min -> 250 0C (30 min)
CapillaryHP-5882.Carrapiso and Garsia, 200750. m/0.32 mm/1.05 μm; Program: 35 0C (10 min) 10 0C/min -> 150 0C 20 0C/min -> 250 0C (10 min)
CapillaryDB-5 MS879.Liu, Xu, et al., 200760. m/0.32 mm/1.0 μm, Helium; Program: 40 0C (2 min) 6 0C/min -> 100 0C 4 0C/min -> 180 0C 8 0C/min -> 250 0C (12 min)
CapillaryHP-5MS867.Mallia, Escher, et al., 2007Program: not specified
CapillaryCP-Sil 5 CB845.Bailly, Jerkovic, et al., 200650. m/0.32 mm/1.20 μm, Helium; Program: 36 0C 20 0C/min -> 85 0C 1 0C/min -> 1345 0C 3 0C/min -> 250 0C
CapillaryCP Sil 5 CB845.Bailly, Jerkovic, et al., 2006, 250. m/0.32 mm/1.2 μm, He; Program: 36C => 20C/min => 85C => 1C/min => 145C => 3C/min => 250C
CapillaryCP Sil 5 CB848.Bailly, Jerkovic, et al., 2006, 250. m/0.32 mm/1.2 μm, He; Program: 36C => 20C/min => 85C => 1C/min => 145C => 3C/min => 250C
CapillaryCP-Sil5 CB MS846.Callemien, Dasnoy, et al., 200650. m/0.32 mm/1.2 μm, N2; Program: 36C => 20C/min => 85C => 1C/min => 145C => 3C/min => 250C(30min)
CapillaryDB-1844.Chantreau, Rochat, et al., 200620. m/0.18 mm/0.18 μm; Program: not specified
CapillaryHP-1852.Senger-Emonnot, Rochard, et al., 200650. m/0.32 mm/0.52 μm, He; Program: 40C => 2C/min => 130C => 4C/min => 250C (25min)
CapillaryCP Sil 5 CB847.Vermeulen, Lejeune, et al., 200650. m/0.32 mm/1.2 μm; Program: 40C(4min) => 2C/min => 132C => 10C/min => 250C (15min)
CapillaryCP-Sil 5 CB846.Callamien, Dasnoy, et al., 200550. m/0.32 mm/1.2 μm, Nitrogen; Program: 36 0C 20 0C/min -> 85 0C 1 iC/min -> 145 0C 3 0C/min -> 250 0C
CapillaryCP-Sil 5 CB846.Callemien, Dasnoy, et al., 200550. m/0.32 mm/1.20 μm, Nitrogen; Program: 36 0C 20 0C/min -> 85 0C 1 0C/min -> 145 0C 3 0C/min -> 250 0C
CapillaryHP-1847.Carpino, Mallia, et al., 200412. m/0.32 mm/0.52 μm; Program: 35C(3min) => 6C/min => 190C => 30C/min => 225C
CapillaryMFE-73890.Escudero, Gogorza, et al., 2004Program: not specified
CapillarySE-30849.Vinogradov, 2004Program: not specified
CapillaryMFE-73890.Ferreira, Ortín, et al., 2002H2; Program: not specified
CapillaryMFE-73870.Aznar, López, et al., 200130. m/0.32 mm/0.1 μm, H2; Program: 40C(5min) => 2C/min => 120C => 10C/min => 210C(30min)
CapillaryMFE-73870.Ferreira, Aznar, et al., 200130. m/0.32 mm/0.1 μm, H2; Program: 40 C (5min) => 2C/min => 120C => 10 C/min => 210 C (30min)
CapillaryCP Sil 5 CB855.Lermusieau, Bulens, et al., 200150. m/0.32 mm/1.2 μm; Program: 36C => 20C/min => 120C(20min) => 2C/min => 250C(30min)
CapillaryDB-5866.Lin, Fay, et al., 200030. m/0.25 mm/0.25 μm, Helium; Program: 35 0C (2 min) 40 0C/min -> 50 0C (1 min) 6 0C/min -> 180 0C 10 0C/min -> 240 0C (10 min)
CapillaryMethyl Silicone849.Misharina, 1995Program: not specified
CapillaryMethyl Silicone849.Misharina, 1995Program: not specified
CapillaryDB-1848.Ruther and Baltes, 199460. m/0.32 mm/1.0 μm, He; Program: 35 0C (5 min), 2 0C/min to 150 0C, 3 0C/min to 260 0C (30 min)
CapillarySE-54870.Blank, Sen, et al., 1992Program: not specified

Normal alkane RI, polar column, temperature ramp

View large format table.

Column type Active phase I Reference Comment
CapillaryDB-Wax1305.Chen, Song, et al., 200930. m/0.32 mm/0.25 μm, Helium, 40. C @ 2. min, 6. K/min, 230. C @ 20. min
CapillaryDB-Wax1311.Chen, Song, et al., 200930. m/0.32 mm/0.25 μm, Helium, 40. C @ 2. min, 6. K/min, 230. C @ 20. min
CapillaryDB-Wax1298.Kishimoto, Wanikawa, et al., 200615. m/0.32 mm/0.25 μm, He, 6. K/min, 230. C @ 20. min; Tstart: 40. C
CapillaryHP-Innowax1284.Senger-Emonnot, Rochard, et al., 200660. m/0.32 mm/0.5 μm, He, 2. K/min, 220. C @ 10. min; Tstart: 60. C
CapillaryDB-Wax1322.Culleré, Escudero, et al., 200430. m/0.32 mm/0.5 μm, H2, 40. C @ 5. min, 4. K/min; Tend: 200. C
CapillaryTC-Wax1302.Ishikawa, Ito, et al., 200460. m/0.25 mm/0.5 μm, He, 40. C @ 8. min, 3. K/min; Tend: 230. C
CapillaryDB-Wax1296.Akiyama, Murakami, et al., 200360. m/0.32 mm/0.25 μm, He, 6. K/min, 230. C @ 20. min; Tstart: 40. C
CapillaryDB-Wax1317.López, Ortín, et al., 200330. m/0.32 mm/0.5 μm, H2, 40. C @ 5. min, 4. K/min; Tend: 200. C
CapillaryDB-Wax1325.Ferreira, Ortín, et al., 200230. m/0.32 mm/0.5 μm, H2, 40. C @ 5. min, 4. K/min; Tend: 200. C
CapillaryDB-Wax1274.Lin, Rouseff, et al., 200230. m/0.32 mm/0.5 μm, He, 7. K/min, 240. C @ 5. min; Tstart: 40. C
CapillaryDB-FFAP1309.Sanz, Czerny, et al., 200230. m/0.32 mm/0.25 μm, He, 40. C @ 2. min, 6. K/min, 230. C @ 5. min
CapillaryDB-Wax1320.Aznar, López, et al., 200130. m/0.32 mm/0.5 μm, H2, 40. C @ 5. min, 4. K/min, 200. C @ 60. min
CapillaryDB-Wax1320.Ferreira, Aznar, et al., 200130. m/0.32 mm/0.5 μm, H2, 40. C @ 5. min, 4. K/min, 200. C @ 60. min
CapillaryDB-Wax1270.Kotseridis and Baumes, 200030. m/0.32 mm/0.5 μm, H2, 60. C @ 3. min, 3. K/min, 245. C @ 20. min
CapillaryDB-Wax1270.Kotseridis and Baumes, 200030. m/0.32 mm/0.5 μm, H2, 60. C @ 3. min, 3. K/min, 245. C @ 20. min
CapillaryDB-Wax1312.Farkas, Sádecká, et al., 199730. m/0.32 mm/0.50 μm, Hydrogen, 35. C @ 0.5 min, 4. K/min; Tend: 250. C
CapillaryDB-Wax1303.Guntert, Brüning, et al., 199060. m/0.32 mm/0.25 μm, He, 3. K/min; Tstart: 60. C; Tend: 220. C

Normal alkane RI, polar column, custom temperature program

View large format table.

Column type Active phase I Reference Comment
CapillaryFFAP1306.Bailly and Collin, 201025. m/0.32 mm/0.30 μm, Nitrogen; Program: 36 0C 20 0C/min -> 85 0C 1 0C/min -> 145 0C 3 0C/min -> 250 0C
CapillaryDB-Wax1315.San-Juan, Petka, et al., 201030. m/0.32 mm/0.50 μm, Hydrogen; Program: 40 0C (5 min) 4 0C/min -> 100 0C 6 0C/min -> 220 0C (20 min)
CapillaryFFAP1306.Bailly, Jerkovic, et al., 200925. m/0.32 mm/0.30 μm, Nitrogen; Program: 36 0C 20 0C/min -> 85 0C 1 0C -> 145 0C 3 0C/min -> 230 0C
CapillaryDB-Wax1315.Ferreira, Juan, et al., 200930. m/0.32 mm/0.50 μm; Program: 40 0C (5 min) 4 0C/min -> 100 0C 6 0C/min -> 220 0C (40 min)
CapillaryHP-FFAP1335.Carrapiso and Garsia, 200730. m/0.32 mm/0.25 μm; Program: 35 0C (10 min) 10 0C/min -> 150 0C 20 0C/min -> 250 0C (10 min)
CapillaryFFAP-CB1306.Bailly, Jerkovic, et al., 200625. m/0.32 mm/0.30 μm, Helium; Program: 36 0C 20 0C/min -> 85 0C 1 0C/min -> 1345 0C 3 0C/min -> 250 0C
CapillaryFFAP1306.Bailly, Jerkovic, et al., 2006, 225. m/0.32 mm/0.3 μm, He; Program: 36C => 20C/min => 85C => 1C/min => 145C => 3C/min => 250C
CapillaryFFAP1306.Bailly, Jerkovic, et al., 2006, 225. m/0.32 mm/0.3 μm, He; Program: 36C => 20C/min => 85C => 1C/min => 145C => 3C/min => 250C
CapillaryFFAP1306.Vermeulen, Lejeune, et al., 200625. m/0.32 mm/0.3 μm; Program: 40C(4min) => 2C/min => 132C => 10C/min => 250C (15min)
CapillaryDB-Wax1325.Escudero, Gogorza, et al., 2004Program: not specified
CapillaryFFAP1305.Bel Rhild, Fleury, et al., 200230. m/0.32 mm/0.25 μm, Helium; Program: 50 0C (2 min) 6 0C/min -> 180 0C 10 0C/min -> 180 0C (10 min)
CapillaryFFAP1325.Blank, Stampfli, et al., 1994Program: not specified

References

Rochat S., de Saint Laumer J.Y., et al., 2007
Rochat S.; de Saint Laumer J.Y.; Chaintreau A., Analysis of sulfur compounds from the in-oven roast beef aroma by comprehensive two-dimensional gas chromatography, J. Chromatogr. A, 2007, 1147, 1, 85-94, https://doi.org/10.1016/j.chroma.2007.02.039 . [all data]

Ruiz Perez-Cacho, Mahattanatawee, et al., 2007
Ruiz Perez-Cacho, P.; Mahattanatawee, K.; Smoot, J.M.; Rouseff, R., Identification of Sulfur Volatiles in Canned Orange Juices Lacking Orange Flavor, J. Agric. Food Chem., 2007, 55, 14, 5761-5767, https://doi.org/10.1021/jf0703856 . [all data]

Sarrazin E., Shinkaruk S., et al., 2007
Sarrazin E.; Shinkaruk S.; Bennetau B.; Frerot E.; Dubourdieu D., Odorous impact of volatile thiols on the aroma of young botrytized sweet wines: Identification and quantification of new sulfanyl alcohols, J. Agric. Food Chem., 2007, 55, 4, 1437-1444, https://doi.org/10.1021/jf062582v . [all data]

Mahadevan and Farmer, 2006
Mahadevan, K.; Farmer, L., Key Odor Impact Compounds in Three Yeast Extract Pastes, J. Agric. Food Chem., 2006, 54, 19, 7242-7250, https://doi.org/10.1021/jf061102x . [all data]

Aliani and Farmer, 2005
Aliani, M.; Farmer, L.J., Precursors of chicken flavor. II. Identification of key flavor precursors using sensory methods, J. Agric. Food Chem., 2005, 53, 16, 6455-6462, https://doi.org/10.1021/jf050087d . [all data]

Mahattanatawee, Goodner, et al., 2005
Mahattanatawee, K.; Goodner, K.L.; Baldwin, E.A., Volatile constituents and character impact compounds of selected Florida's tropical fruit, Proc. Fla. State Hort. Soc., 2005, 118, 414-418. [all data]

Whetstine, Cadwallader, et al., 2005
Whetstine, M.E.C.; Cadwallader, K.R.; Drake, M.A., Characterization of aroma compounds responsible for the rosy/floral flavor in cheddar cheese, J. Agric. Food Chem., 2005, 53, 8, 3126-3132, https://doi.org/10.1021/jf048278o . [all data]

Avsar, Karagul-Yuceer, et al., 2004
Avsar, Y.K.; Karagul-Yuceer, Y.; Drake, M.A.; Singh, T.K.; Yoon, Y.; Cadwallader, K.R., Characterization of nutty flavor in cheddar cheese, J. Dairy Sci., 2004, 87, 7, 1999-2010, https://doi.org/10.3168/jds.S0022-0302(04)70017-X . [all data]

Dreher, Rouseff, et al., 2003
Dreher, J.G.; Rouseff, R.L.; Naim, M., GC-olfactometric characterization of aroma volatiles from the thermal degradation of thiamin in model orange juice, J. Agric. Food Chem., 2003, 51, 10, 3097-3102, https://doi.org/10.1021/jf034023j . [all data]

Valim, Rouseff, et al., 2003
Valim, M.F.; Rouseff, R.L.; Lin, J., Gas chromatographic-olfactometric characterization of aroma compounds in two types of cashew apple nectar, J. Agric. Food Chem., 2003, 51, 4, 1010-1015, https://doi.org/10.1021/jf025738+ . [all data]

Elmore, Campo, et al., 2002
Elmore, J.S.; Campo, M.M.; Enser, M.; Mottram, D.S., Effect of lipid composition on meat-like model systems containing cysteine, ribose, and polyunsaturated fatty acids, J. Agric. Food Chem., 2002, 50, 5, 1126-1132, https://doi.org/10.1021/jf0108718 . [all data]

Wu and Cadwallader, 2002
Wu, Y.-F.G.; Cadwallader, K.R., Characterization of the aroma of a meatlike process flavoring from soybean-based enzyme-hydrolyzed vegetable protein, J. Agric. Food Chem., 2002, 50, 10, 2900-2907, https://doi.org/10.1021/jf0114076 . [all data]

Ames, Guy, et al., 2001
Ames, J.M.; Guy, R.C.E.; Kipping, G.J., Effect of pH and temperature on the formation of volatile compounds in cysteine/reducing sugar/starch mixtures during extrusion cooking, J. Agric. Food Chem., 2001, 49, 4, 1885-1894, https://doi.org/10.1021/jf0012547 . [all data]

Baek, Kim, et al., 2001
Baek, H.H.; Kim, C.J.; Ahn, B.H.; Nam, H.S.; Cadwallader, K.R., Aroma extract dilution analysis of a beeflike process flavor from extruded enzyme-hydrolyzed soybean protein, J. Agric. Food Chem., 2001, 49, 2, 790-793, https://doi.org/10.1021/jf000609j . [all data]

Bezman, Rouseff, et al., 2001
Bezman, Y.; Rouseff, R.L.; Naim, M., 2-Methyl-3-furanthiol and methional are possible off-flavors in stored orange juice: aroma-similarity, NIF/SNIF GC-O, and GC analyses, J. Agric. Food Chem., 2001, 49, 11, 5425-5432, https://doi.org/10.1021/jf010724+ . [all data]

Chevance and Farmer, 1999
Chevance, F.F.V.; Farmer, L.J., Identification of major volatile odor compounds in frankfurters, J. Agric. Food Chem., 1999, 47, 12, 5151-5160, https://doi.org/10.1021/jf990515d . [all data]

Whitfield and Mottram, 1999
Whitfield, F.B.; Mottram, D.S., Investigation of the reaction between 4-hydroxy-5-methyl-3(2H)-furanone and cysteine or hydrogen sulfide at pH 4.5, J. Agric. Food Chem., 1999, 47, 4, 1626-1634, https://doi.org/10.1021/jf980980v . [all data]

Madruga and Mottram, 1998
Madruga, M.S.; Mottram, D.S., The effect of pH on the formation of volatile compounds produced by heating a model system containing 5'-imp and cysteine, J. Braz. Chem. Soc., 1998, 9, 3, 261-271, https://doi.org/10.1590/S0103-50531998000300010 . [all data]

Misharina, Golovnya, et al., 1994
Misharina, T.A.; Golovnya, R.V.; Strashnenko, E.S.; Medvedeva, I.B., Sorbtion-structural mass-spectrometric characteristics of volatile components of model systems and flavor compounds with meat odor, Zh. Anal. Khim., 1994, 49, 7, 722-728. [all data]

Misharina, Golovnya, et al., 1993
Misharina, T.A.; Golovnya, R.V.; Beletsky, I.V., Sorption properties of heterocyclic compounds differing by heteroatom in capillary gas chromatography, Russ. Chem. Bull. (Engl. Transl.), 1993, 42, 7, 1167-1170, https://doi.org/10.1007/BF00701998 . [all data]

Misharina, Golovnya, et al., 1992
Misharina, T.A.; Golovnya, R.V.; Artamonova, M.P.; Zhuravskaya, N.K., Identification of volatile components of a model system with meat aroma, Zh. Anal. Khim., 1992, 47, 850-857. [all data]

Misharina, Aerove, et al., 1991
Misharina, T.A.; Aerove, A.F.; Golovnya, R.E.; Kalugina, V.I.; Rogovskaya, L.V.; Vysotskaya, L.E.; Shevtsov, V.K., Identification of volatile components of an aromatizer with a chicken odor by chromatography-mass spectrometry and chromatography-fourier transform infrared spectroscopy, J. Anal. Chem. USSR (Engl. Transl.), 1991, 8, 1187-1193. [all data]

Zhang and Ho, 1991
Zhang, Y.; Ho, C.-T., Formation of meatlike aroma compounds from thermal reaction of inosine 5'-monophosphate with cysteine and glutathione, J. Agric. Food Chem., 1991, 39, 6, 1145-1148, https://doi.org/10.1021/jf00006a031 . [all data]

Escudero, Campo, et al., 2007
Escudero, A.; Campo, E.; Fariña, L.; Cacho, J.; Ferreira, V., Analytical Characterization of the Aroma of Five Premium Red Wines. Insights into the Role of Odor Families and the Concept of Fruitiness of Wines, J. Agric. Food Chem., 2007, 55, 11, 4501-4510, https://doi.org/10.1021/jf0636418 . [all data]

Majcher and Jelen, 2007
Majcher, M.A.; Jelen, H.H., Effect of Cysteine and Cystine Addition on Sensory Profile and Potent Odorants of Extruded Potato Snacks, J. Agric. Food Chem., 2007, 55, 14, 5754-5760, https://doi.org/10.1021/jf0703147 . [all data]

Moon, Cliff, et al., 2006
Moon, S.-Y.; Cliff, M.A.; Li-Chan, E.C.Y., Odour-active components of simulated beef flavour analysed by solid phase microextraction and gas chromatography-mass spectrometry and -olfactometry, Food Res. Int., 2006, 39, 3, 294-308, https://doi.org/10.1016/j.foodres.2005.08.002 . [all data]

Campo, Ferreira, et al., 2005
Campo, E.; Ferreira, V.; Escudero, A.; Cacho, J., Prediction of the wine sensory properties related to grape variety from dynamic-headspace gas chromatography-olfactometry data, J. Agric. Food Chem., 2005, 53, 14, 5682-5690, https://doi.org/10.1021/jf047870a . [all data]

Carrapiso, Jurado, et al., 2002
Carrapiso, A.I.; Jurado, Á.; Timón, M.L.; García, C., Odor-active compounds of Iberian hams with different aroma characteristics, J. Agric. Food Chem., 2002, 50, 22, 6453-6458, https://doi.org/10.1021/jf025526c . [all data]

Carrapiso, Ventanas, et al., 2002
Carrapiso, A.I.; Ventanas, J.; García, C., Characterization of the most odor-active compounds of Iberian ham headspace, J. Agric. Food Chem., 2002, 50, 7, 1996-2000, https://doi.org/10.1021/jf011094e . [all data]

Hofmann and Schieberle, 1998
Hofmann, T.; Schieberle, P., Identification of key aroma compounds generated from cysteine and carbohydrates under roasting conditions, Z. Lebensm. Unters. Forsch. A, 1998, 207, 3, 229-236, https://doi.org/10.1007/s002170050324 . [all data]

Hofmann and Schieberle, 1995
Hofmann, T.; Schieberle, P., Evaluation of the key odorants in a thermally treated solution of ribose and cysteine by aroma extract dilution techniques, J. Agric. Food Chem., 1995, 43, 8, 2187-2194, https://doi.org/10.1021/jf00056a042 . [all data]

Mottram and Whitfield, 1995
Mottram, D.S.; Whitfield, F.B., Volatile compounds from the reaction of cysteine, ribose, and phospholipid in low-moisture systems, J. Agric. Food Chem., 1995, 43, 4, 984-988, https://doi.org/10.1021/jf00052a027 . [all data]

Gurbuz O., Rouseff J.M., et al., 2006
Gurbuz O.; Rouseff J.M.; Rouseff R.L., Comparison of aroma volatiles in commercial Merlot and Cabernet Sauvignon wines using gas chromatography - Olfactometry and gas chromatography - Mass spectrometry, J. Agric. Food Chem., 2006, 54, 11, 3990-3996, https://doi.org/10.1021/jf053278p . [all data]

Petka, Ferreira, et al., 2006
Petka, J.; Ferreira, V.; González-Viñas, M.A.; Cacho, J., Sensory and Chemical Characterization of the Aroma of a White Wine Made with Devín Grapes, J. Agric. Food Chem., 2006, 54, 3, 909-915, https://doi.org/10.1021/jf0518397 . [all data]

Varming, Petersen, et al., 2004
Varming, C.; Petersen, M.A.; Poll, L., Comparison of isolation methods for the determination of important aroma compounds in black currant (Ribes nigrum L.) juice, using nasal impact frequency profiling, J. Agric. Food Chem., 2004, 52, 6, 1647-1652, https://doi.org/10.1021/jf035133t . [all data]

Chevance and Farmer, 1999, 2
Chevance, F.F.V.; Farmer, L.J., Release of volatile odor compounds from full-fat and reduced-fat frankfurters, J. Agric. Food Chem., 1999, 47, 12, 5161-5168, https://doi.org/10.1021/jf9905166 . [all data]

Ruther and Baltes, 1994
Ruther, J.; Baltes, W., Sulfur-containing furans in commercial meat flavorings, J. Agric. Food Chem., 1994, 42, 10, 2254-2259, https://doi.org/10.1021/jf00046a032 . [all data]

Whitfield, Mottram, et al., 1988
Whitfield, F.B.; Mottram, D.S.; Brock, S.; Puckey, D.J.; Salter, L.J., Effect of Phospholipid on the Formation of Volatile Heterocyclic Compounds in Heated Aqueous Solutions of Amino Acids and Ribose, J. Sci. Food Agric., 1988, 42, 3, 261-272, https://doi.org/10.1002/jsfa.2740420309 . [all data]

Jezussek, Juliano, et al., 2002
Jezussek, M.; Juliano, B.O.; Schieberle, P., Comparison of key aroma compounds in cooked brown rice varieties based on aroma extract dilution analysis, J. Agric. Food Chem., 2002, 50, 5, 1101-1105, https://doi.org/10.1021/jf0108720 . [all data]

Rhlid, Fleury, et al., 2002
Rhlid, R.B.; Fleury, Y.; Blank, I.; Fay, L.B.; Welti, D.H.; Vera, F.A.; Juillerat, M.A., Generation of roasted notes based on 2-acetyl-2-thiazoline and its precursor, 2-(1-hydroxyethyl)-4,5-dihydrothiazole, by combined bio and thermal approaches, J. Agric. Food Chem., 2002, 50, 8, 2350-2355, https://doi.org/10.1021/jf011170d . [all data]

Shedid, 2010
Shedid, S., Chemical composition and antioxidant activity of Mallard reaction products generated from glutathione or Cysteine/glucose, World Appl. Sci. J., 2010, 9, 10, 1148-1154. [all data]

Chen, Song, et al., 2009
Chen, G.; Song, H.; Ma, C., Aroma-active aompounds of Beijing roast duck, Flavour Fragr. J., 2009, 24, 4, 186-191, https://doi.org/10.1002/ffj.1932 . [all data]

Fadel, Mageed, et al., 2006
Fadel, H.H.M.; Mageed, M.A.A.; Lotfy, S.N., Quality and flavour stability of coffee substitute prepared by extrusion of wheat germ and chicory roots, Amino Acids, 2006, https://doi.org/10.1007/s007260200008 . [all data]

Lin, Rouseff, et al., 2002
Lin, J.; Rouseff, R.L.; Barros, S.; Naim, M., Aroma composition changes in early season grapefruit juice produced from thermal concentration, J. Agric. Food Chem., 2002, 50, 4, 813-819, https://doi.org/10.1021/jf011154g . [all data]

Sanz, Czerny, et al., 2002
Sanz, C.; Czerny, M.; Cid, C.; Schieberle, P., Comparison of potent odorants in a filtered coffee brew and in an instant coffee beverage by aroma extract dilution analysis (AEDA), Eur. Food Res. Technol., 2002, 214, 4, 299-302, https://doi.org/10.1007/s00217-001-0459-9 . [all data]

Friedrich, Acree, et al., 2001
Friedrich, J.E.; Acree, T.E.; Lavin, E.H., Selecting standards for gas chromatography - olfactometry, Am. Chem. Soc. Symp. Ser., 2001, 782, 148-155. [all data]

Lee, Suriyaphan, et al., 2001
Lee, G.-H.; Suriyaphan, O.; Cadwallader, K.R., Aroma components of cooked tail meat of American lobster (Homarus americanus), J. Agric. Food Chem., 2001, 49, 9, 4324-4332, https://doi.org/10.1021/jf001523t . [all data]

Kotseridis and Baumes, 2000
Kotseridis, Y.; Baumes, R., Identification of impact odorants in Bordeaux red grape juice, in the commercial yeast used for its fermentation, and in the produced wine, J. Agric. Food Chem., 2000, 48, 2, 400-406, https://doi.org/10.1021/jf990565i . [all data]

Deibler, Acree, et al., 1998
Deibler, K.D.; Acree, T.E.; Lavin, E.H., Aroma analysis of coffrr brew by gas chromatography-oldfactometry, Developments in Food Sci., 1998, 40, 69-78. [all data]

Farkas, Sádecká, et al., 1997
Farkas, P.; Sádecká, J.; Kovác, M.; Siegmund, B.; Leitner, E.; Pfannhauser, W., Key odourants of pressure-cooked hen meat, Food Chem., 1997, 60, 4, 617-621, https://doi.org/10.1016/S0308-8146(97)00042-3 . [all data]

Güntert, Bertram, et al., 1992
Güntert, M.; Bertram, H.-J.; Hopp, R.; Silberzahn, W.; Sommer, H.; Werkhoff, P., Thermal generation of flavor compounds from thiamin and various amino acids in Recent developments in flavor and fragrance chemistry. Proceedings of the 3rd International Haarmann Reimer Symposium, Hopp,R.; Mori,K., ed(s)., VCH Publishers, New York, 1992, 215-240. [all data]

Guntert, Brüning, et al., 1990
Guntert, M.; Brüning, J.; Emberger, R.; Köpsel, Ml; Kuhn, W.; Thielmann, T.; Werkhoff, P., Identification and formation of some selected sulfur-containing flavor compounds in various meat model systems, J. Agric. Food Chem., 1990, 38, 11, 2027-2041, https://doi.org/10.1021/jf00101a007 . [all data]

Werkhoff, Bruning, et al., 1990
Werkhoff, P.; Bruning, J.; Emberger, R.; Guntert, M.; Kopsel, M.; Kuhn, W.; Surburg, H., Isolation and Characterization of Volatile Sulfur-Containing Meat Flavor Components in Model Systems, J. Agric. Food Chem., 1990, 38, 3, 777-791, https://doi.org/10.1021/jf00093a041 . [all data]

San-Juan, Petka, et al., 2010
San-Juan, F.; Petka, J.; Cacho, J.; Ferreira, V.; Escudero, A., Producing headspace extracts for the gas chromatography - olphactometric evaluation of wine aroma, Food Chemistry, 2010, 123, 1, 188-195, https://doi.org/10.1016/j.foodchem.2010.03.129 . [all data]

Xu, He, et al., 2010
Xu, H.; He, W.; Liu, X.; Gao, Y., Effect of pressure on the Maillard reaction between ribose and cysteine in supercritical carbon dioxide, Czech J. Food Sci., 2010, 28, 3, 192-201. [all data]

Bailly, Jerkovic, et al., 2009
Bailly, S.; Jerkovic, V.; Meuree, A.; Timmermans, A.; Collin, S., Fate of key odorants in Sauternes wines through aging, J. Agric. Food Chem., 2009, 57, 18, 8557-8563, https://doi.org/10.1021/jf901429d . [all data]

Collin, Nizet, et al., 2008
Collin, S.; Nizet, S.; Muls, S.; Iraqi, R.; Bouseta, A., Characterization of odor-active compounds in extracts obtained by simultaneous extraction/distillation from Moroccan black olives, J. Agric. Food Chem., 2008, 56, 9, 3273-3278, https://doi.org/10.1021/jf073488x . [all data]

Carrapiso and Garsia, 2007
Carrapiso, A.I.; Garsia, C., Effect of sampling conditions on the odour-active compounds of iberian ham, Cienc. Technol. Aliment., 2007, 5, 4, 287-290, https://doi.org/10.1080/11358120709487703 . [all data]

Liu, Xu, et al., 2007
Liu, Y.; Xu, X.-L.; Zhou, G.-H., Comparative study of volatile compounds in traditional Chinese Nanjing marinated duck by different extraction techniques, Int. J. Food Sci. Technol., 2007, 42, 5, 543-550, https://doi.org/10.1111/j.1365-2621.2006.01264.x . [all data]

Mallia, Escher, et al., 2007
Mallia, S.; Escher, F.; Rehberger, B.; Schlichtherle-Cerny, H., Aroma-active secondary oxidation products of butter, 3rd QLIF Congress, Hohenheim, Germany, March 20-23, 2007, 2007, retrieved from http://orgprints.org/view/projects/intconfqlif2007.html; http://orgprints.org/9734/. [all data]

Bailly, Jerkovic, et al., 2006
Bailly, S.; Jerkovic, V.; Collin, S., Identification of key-odorants in Sauternes wines, Identification of key-odorants in Sauternes wines, 5th International Terroir Congress, 2006, 4. [all data]

Bailly, Jerkovic, et al., 2006, 2
Bailly, S.; Jerkovic, V.; Marchand-Brynaert, J.; Collin, S., Aroma Extraction Dilution Analysis of Sauternes Wines. Key Role of Polyfunctional Thiols, J. Agric. Food Chem., 2006, 54, 19, 7227-7234, https://doi.org/10.1021/jf060814k . [all data]

Callemien, Dasnoy, et al., 2006
Callemien, D.; Dasnoy, S.; Collin, S., Identification of a stale-beer-like odorant in extracts of naturally aged beer, J. Agric. Food Chem., 2006, 54, 4, 1409-1413, https://doi.org/10.1021/jf051772n . [all data]

Chantreau, Rochat, et al., 2006
Chantreau, A.; Rochat, S.; de Saint Laumer, J.-Y., Re-investigation of sulfur impact odorants in roast beef using comprehensive two-dimensional GC-TOF-MS and the GC-SNIF, Developments Food. Sci., 2006, 43, 601-604. [all data]

Senger-Emonnot, Rochard, et al., 2006
Senger-Emonnot, P.; Rochard, S.; Pellegrin, F.; George, G.; Fernandez, X.; Lizzani-Cuvelier, L., Odour active aroma compounds of sea fig (Microcosmus sulcatus), Food Chem., 2006, 97, 3, 465-471, https://doi.org/10.1016/j.foodchem.2005.05.026 . [all data]

Vermeulen, Lejeune, et al., 2006
Vermeulen, C.; Lejeune, I.; Tran, T.T.H.; Collin, S., Occurrence of polyfunctional thiols in fresh lager beers, J. Agric. Food Chem., 2006, 54, 14, 5061-5068, https://doi.org/10.1021/jf060669a . [all data]

Callamien, Dasnoy, et al., 2005
Callamien, D.; Dasnoy, S.; Heynen, O.; Badot, C.; Collin, S., Flavour stability of lager beer: identification of a new key staling compounds, Eur. Brewery Convention, 2005, 91, 815-822. [all data]

Callemien, Dasnoy, et al., 2005
Callemien, D.; Dasnoy, S.; Heynen, O.; Badot, C.; Collin, S., Flavour stability of lager beer: identification of a new key staling compound in European Brewery Convention, Fachverlag Hans Carl, Nurnberg, Germany, 2005, 815-822. [all data]

Carpino, Mallia, et al., 2004
Carpino, S.; Mallia, S.; Licitra, G.; van Soest, P.J.; Acree, T.E., Aroma compounds of some Hyblean pasture species, Flavour Fragr. J., 2004, 19, 4, 293-297, https://doi.org/10.1002/ffj.1346 . [all data]

Escudero, Gogorza, et al., 2004
Escudero, A.; Gogorza, B.; Melús, M.A.; Ortín, N.; Cacho, J.; Ferreira, V., Characterization of the aroma of a wine from Maccabeo. Key role played by compounds with low odor activity values, J. Agric. Food Chem., 2004, 52, 11, 3516-3524, https://doi.org/10.1021/jf035341l . [all data]

Vinogradov, 2004
Vinogradov, B.A., Production, composition, properties and application of essential oils, 2004, retrieved from http://viness.narod.ru. [all data]

Ferreira, Ortín, et al., 2002
Ferreira, V.; Ortín, N.; Escudero, A.; López, R.; Cacho, J., Chemical characterization of the aroma of grenache Rosé wines: aroma extract dilution analysis, quantitative determination, and sensory reconstitution studies, J. Agric. Food Chem., 2002, 50, 14, 4048-4054, https://doi.org/10.1021/jf0115645 . [all data]

Aznar, López, et al., 2001
Aznar, M.; López, R.; Cacho, J.F.; Ferreira, V., Identification and quantification of impact odorants of aged red wines from Rioja. GC-olfactometry, quantitative GC-MS, and odor evaluation of HPLC fractions, J. Agric. Food Chem., 2001, 49, 6, 2924-2929, https://doi.org/10.1021/jf001372u . [all data]

Ferreira, Aznar, et al., 2001
Ferreira, V.; Aznar, M.; López, R.; Cacho, J., Quantitative gas chromatography-olfactometry carried out at different dilutions of an extract. Differences in the odor profiles of four high-quality spanish aged red wines, J. Agric. Food Chem., 2001, 49, 10, 4818-4824, https://doi.org/10.1021/jf010283u . [all data]

Lermusieau, Bulens, et al., 2001
Lermusieau, G.; Bulens, M.; Collin, S., Use of GC-olfactometry to identify the hop aromatic compounds in beer, J. Agric. Food Chem., 2001, 49, 8, 3867-3874, https://doi.org/10.1021/jf0101509 . [all data]

Lin, Fay, et al., 2000
Lin, J.; Fay, L.B.; Blank, I., Aroma impact compounds formed in meat-like model systems containing cysteine, ribose, and phospholipids in Frontiers of Flavour Science, Scheberle, P.; Engel, K.-H., ed(s)., Deutsche Forschungsanstalt fur Lebensmittelchemie, Garching, 2000, 498-502. [all data]

Misharina, 1995
Misharina, T.A., Sorption regularities of sulfur- and oxygen-containing compounds in chromatography and their application in identification of volatile organic compounds, Diss. degree of Dr. Sci. (Chemistry), 1995, 52. [all data]

Blank, Sen, et al., 1992
Blank, I.; Sen, A.; Grosch, W., Potent odorants of the roasted powder and brew of Arabica coffee, Z. Lebensm. Unters Forsch., 1992, 195, 3, 239-245, https://doi.org/10.1007/BF01202802 . [all data]

Kishimoto, Wanikawa, et al., 2006
Kishimoto, T.; Wanikawa, A.; Kono, K.; Shibata, K., Comparison of the Odor-Active Compounds in Unhopped Beer and Beers Hopped with Different Hop Varieties, J. Agric. Food Chem., 2006, 54, 23, 8855-8861, https://doi.org/10.1021/jf061342c . [all data]

Culleré, Escudero, et al., 2004
Culleré, L.; Escudero, A.; Cacho, J.; Ferreira, V., Gas chromatography-olfactometry and chemical quantitative study of the aroma of six premium auality Spanish aged red wines, J. Agric. Food Chem., 2004, 52, 6, 1653-1660, https://doi.org/10.1021/jf0350820 . [all data]

Ishikawa, Ito, et al., 2004
Ishikawa, M.; Ito, O.; Ishizaki, S.; Kurobayashi, Y.; Fujita, A., Solid-phase aroma concentrate extraction (SPACE ): a new headspace technique for more sensitive analysis of volatiles, Flavour Fragr. J., 2004, 19, 3, 183-187, https://doi.org/10.1002/ffj.1322 . [all data]

Akiyama, Murakami, et al., 2003
Akiyama, M.; Murakami, K.; Ohtani, N.; Iwatsuki, K.; Sotoyama, K.; Wada, A.; Tokuno, K.; Iwabuchi, H.; Tanaka, K., Analysis of volatile compounds released during the grinding of roasted coffee beans using solid-phase microextraction, J. Agric. Food Chem., 2003, 51, 7, 1961-1969, https://doi.org/10.1021/jf020724p . [all data]

López, Ortín, et al., 2003
López, R.; Ortín, N.; Pérez-Trujillo, J.P.; Cacho, J.; Ferreira, V., Impact odorants of different young white wines from the Canary islands, J. Agric. Food Chem., 2003, 51, 11, 3419-3425, https://doi.org/10.1021/jf026045w . [all data]

Bailly and Collin, 2010
Bailly, S.; Collin, S., Fate of polyunsaturated thiols in sauternes wines through ageing in Expression of Multidisciplinary Flavour Sci., Blank, I.; Wust, M.; Yertzian, C., ed(s)., Zhaw Ed., 2010, 227-230, retrieved from https://home.zhaw.ch/tildayere/pdf/Teil58-Expression of Multidisciplinary.pdf. [all data]

Ferreira, Juan, et al., 2009
Ferreira, V.; Juan, F.S.; Escudero, A.; Cullere, L.; Fernandez-Zurbano, P.; Saenz-Navajas, M.P.; Cacho, J., Modeling quality of premium Spanish red wines from gas chromatography-olfactometry data, J. Agr. Food. Chem., 2009, 57, 16, 7490-7498, https://doi.org/10.1021/jf9006483 . [all data]

Bel Rhild, Fleury, et al., 2002
Bel Rhild, R.; Fleury, Y.; Devaud, S.; Fay, L.B.; Blank, I.; Juillerat, M.A., Biogeneration of roasted noted based on 2-acetyl-2-thiazoline and the precursor 2-(1-hydroxyethyl)-4,5-dihydrothiazole, 2002, retrieved from http://www.imrablank.ch/ACS2002826179.pdf. [all data]

Blank, Stampfli, et al., 1994
Blank, I.; Stampfli, A.; Eisenreich, W., Analysis of food flavourings by gas chromatography - olfactometry in Trends of Flavour Research, Maarse, H.; van der Heij, D.G., ed(s)., 1994, 271-276. [all data]