Boranamine
- Formula: BH4N
- Molecular weight: 28.849
- IUPAC Standard InChIKey: KKAXNAVSOBXHTE-UHFFFAOYSA-N
- CAS Registry Number: 14720-35-5
- Chemical structure:
View 3d structure (requires JavaScript / HTML 5) - Permanent link for this species. Use this link for bookmarking this species for future reference.

Gas phase ion energetics data

Data compiled as indicated in comments:
RDSH - Henry M. Rosenstock, Keith Draxl, Bruce W. Steiner, and John T. Herron
LLK - Sharon G. Lias, Rhoda D. Levin, and Sherif A. Kafafi
Ionization energy determinations
IE (eV) | Method | Reference | Comment |
---|---|---|---|
11.0 ± 0.1 | EI | Kwon and McGee, 1970 | RDSH |
Appearance energy determinations
Ion | AE (eV) | Other Products | Method | Reference | Comment |
---|---|---|---|---|---|
B+ | 19.2 ± 0.05 | ? | EI | Rothgery, McGee, et al., 1975 | LLK |
HB+ | 18.0 ± 0.1 | NH3 | EI | Rothgery, McGee, et al., 1975 | LLK |
H2B+ | 17.2 ± 0.2 | NH2 | EI | Rothgery, McGee, et al., 1975 | LLK |

Vibrational and/or electronic energy levels

Data compiled by: Marilyn E. Jacox
State: X
Additional references: Jacox, 1994, page 309; Sugie, Takeo, et al., 1979; Vormann, Dreizler, et al., 1991

References

Kwon and McGee, 1970
Kwon, C.T.; McGee, H.A., Jr.,
Cryochemical preparation of monomeric aminoborane,
Inorg. Chem., 1970, 9, 2458. [all data]
Rothgery, McGee, et al., 1975
Rothgery, E.F.; McGee, H.A., Jr.; Pusatcioglu, S.,
Aminodifluoroborane,
Inorg. Chem., 1975, 14, 2236. [all data]
Gerry, Lewis-Bevan, et al., 1985
Gerry, M.C.L.; Lewis-Bevan, W.; Merer, A.J.; Westwood, N.P.C.,
The infrared spectrum of gaseous aminoborane, H2N«58875»BH2: Location of the fundamentals and rotational structure in the 401 band (BN stretching vibration at 1337 cm-1),
J. Mol. Spectrosc., 1985, 110, 1, 153, https://doi.org/10.1016/0022-2852(85)90219-X
. [all data]
Carpenter and Ault, 1991
Carpenter, J.D.; Ault, B.S.,
Infrared matrix isolation characterization of aminoborane and related compounds,
J. Phys. Chem., 1991, 95, 9, 3502, https://doi.org/10.1021/j100162a013
. [all data]
Anderson, Gerry, et al.
Anderson, W.D.; Gerry, M.C.L.; Lewis-Bevan, W.; Merer, A.J.; Steunenberg, D.M.,
41st Symposium on Molecular Spectroscopy, Columbus, Ohio, June 1986.. [all data]
Jacox, 1994
Jacox, M.E.,
Vibrational and electronic energy levels of polyatomic transient molecules, American Chemical Society, Washington, DC, 1994, 464. [all data]
Sugie, Takeo, et al., 1979
Sugie, M.; Takeo, H.; Matsumura, C.,
Microwave spectrum of aminoborane, BH2NH2,
Chem. Phys. Lett., 1979, 64, 3, 573, https://doi.org/10.1016/0009-2614(79)80247-X
. [all data]
Vormann, Dreizler, et al., 1991
Vormann, K.; Dreizler, H.; Doose, J.; Guarnieri, A.,
Z. Naturforsch., 1991, 46a, 770. [all data]