(-)-Aromadendra-1(10),3-diene

Van Den Dool and Kratz RI, non-polar column, custom temperature program

View large format table.

Column type Active phase I Reference Comment
CapillaryCP Sil 5 CB1512.Adio and König, 2005Program: not specified

References

Adio and König, 2005
Adio, A.M.; König, W.A., Sesquiterpene constituents from the essential oil of the liverwort Plagiochila asplenioides, Phytochemistry, 2005, 66, 5, 599-609, https://doi.org/10.1016/j.phytochem.2005.01.015 . [all data]