3-chloro-24-methyl-δ5-Cholestene

Normal alkane RI, non-polar column, temperature ramp

View large format table.

Column type Active phase I Reference Comment
PackedOV-1013170.Velísek, Davídek, et al., 1986N2, Chromatron N-AW-DMCS, 5. K/min; Column length: 2.4 m; Tstart: 100. C; Tend: 240. C

References

Velísek, Davídek, et al., 1986
Velísek, J.; Davídek, J.; Kubelka, V., Formation of Δ3,5-diene and 3-chloro Δ5-ene analogues of sterols in protein hydrolysates, J. Agric. Food Chem., 1986, 34, 4, 660-662, https://doi.org/10.1021/jf00070a017 . [all data]