3-Eicosyne

Normal alkane RI, non-polar column, temperature ramp

Data compiled by: NIST Mass Spectrometry Data Center, William E. Wallace, director

Column type CapillaryCapillary
Active phase SPB-1SPB-1
Column length (m) 30.30.
Carrier gas HeliumHelium
Substrate
Column diameter (mm) 0.320.32
Phase thickness (μm) 0.250.25
Tstart (C) 30.30.
Tend (C) 250.250.
Heat rate (K/min) 4.4.
Initial hold (min) 3.3.
Final hold (min) 10.10.
I 1987.1989.
ReferenceEscalona-Arranz, Perez-Roses, et al., 2010Escalona-Arranz, Perez-Roses, et al., 2010
Comment MSDC-RI MSDC-RI

Phase change data

Data compiled by: William E. Acree, Jr., James S. Chickos

Enthalpy of vaporization

ΔvapH (kJ/mol) Temperature (K) Reference Comment
68.4485.Dykyj, Svoboda, et al., 1999Based on data from 470. - 648. K.

References

Escalona-Arranz, Perez-Roses, et al., 2010
Escalona-Arranz, J.C.; Perez-Roses, R.; Jimenez, I.L.; Rodriguez-Amado, J.; Argota-Coello, H.; Canizares-Lay, J.; Morris-Quevedo, H.J.; Sierra-Gonzales, G., Chemical constituents of Tamarindus indica L. leaves, Rev. Cubana Quim., 2010, 22, 3, 65-71. [all data]