Carbamic acid, phenyl-, methyl ester

Kovats' RI, non-polar column, isothermal

View large format table.

Column type Active phase Temperature (C) I Reference Comment
PackedSE-30140.1315.Gerqasimenko and Voskoboinikov, 1987Column length: 1. m
PackedSE-30140.1320.Gerqasimenko and Voskoboinikov, 1987Column length: 1. m
PackedSE-30160.1317.Gerqasimenko and Voskoboinikov, 1987Column length: 1. m
PackedSE-30160.1336.Gudovicheva and Boitsov, 1985Column length: 100. m

Kovats' RI, polar column, isothermal

View large format table.

Column type Active phase Temperature (C) I Reference Comment
PackedPEG 4000160.1995.Gudovicheva and Boitsov, 1985N2, Inerton AW (0.16-0.20 mm); Column length: 1. m

Normal alkane RI, non-polar column, isothermal

View large format table.

Column type Active phase Temperature (C) I Reference Comment
PackedSE-30164.1313.Singlair, Macho, et al., 1989Nitrogen, Chromaton N AW DMCS; Column length: 2.5 m
PackedSE-30182.1330.Singlair, Macho, et al., 1989Nitrogen, Chromaton N AW DMCS; Column length: 2.5 m
PackedSE-30200.1340.Singlair, Macho, et al., 1989Nitrogen, Chromaton N AW DMCS; Column length: 2.5 m

References

Gerqasimenko and Voskoboinikov, 1987
Gerqasimenko, V.A.; Voskoboinikov, V.V., Thermostability and gas chromatographic retention of substituted alkylarlcarbmates, Zh. Anal. Khim., 1987, 62, 11, 2043-2047. [all data]

Gudovicheva and Boitsov, 1985
Gudovicheva, N.N.; Boitsov, E.N., Gas-liquid chromatography of secondary carbamates, Zh. Anal. Khim., 1985, 40, 8, 1521-1524. [all data]

Singlair, Macho, et al., 1989
Singlair, M.; Macho, V.; Terlandova, J., Fas chromatography of alkyl N-phenylcarbamates, Chem. Papers, 1989, 43, 4, 519-525. [all data]