Benzenamine, 2,4-dimethyl-
- Formula: C8H11N
- Molecular weight: 121.1796
- IUPAC Standard InChIKey: CZZZABOKJQXEBO-UHFFFAOYSA-N
- CAS Registry Number: 95-68-1
- Chemical structure:
View 3d structure (requires JavaScript / HTML 5) - Other names: 2,4-Xylidine; m-Xylidine; 1-Amino-2,4-dimethylbenzene; 2,4-Dimethylaniline; 4-Amino-1,3-dimethylbenzene; 4-Amino-1,3-xylene; 2,4-Dimethylbenzeneamine; m-4-Xylidine; Aniline, 2,4-dimethyl-; 2-Methyl-p-toluidine; 2,4-Dimethylbenzenamine; 4-Amino-3-methyltoluene; 4-Methyl-o-toluidine; 2,4-Dimethylphenylamine; 2,4-Xylylamine; NSC 7640

Condensed phase thermochemistry data

Data compiled by: Hussein Y. Afeefy, Joel F. Liebman, and Stephen E. Stein
Quantity | Value | Units | Method | Reference | Comment |
---|---|---|---|---|---|
ΔfH°liquid | -88.7 | kJ/mol | Ccb | Lemoult, 1907 | |
Quantity | Value | Units | Method | Reference | Comment |
ΔcH°liquid | -4655.5 | kJ/mol | Ccb | Lemoult, 1907 |

Phase change data

Data compiled as indicated in comments:
BS - Robert L. Brown and Stephen E. Stein
TRC - Thermodynamics Research Center, NIST Boulder Laboratories, Chris Muzny director
AC - William E. Acree, Jr., James S. Chickos
Quantity | Value | Units | Method | Reference | Comment |
---|---|---|---|---|---|
Tboil | 491.2 | K | N/A | Aldrich Chemical Company Inc., 1990 | BS |
Tboil | 487.45 | K | N/A | Buehler, Wood, et al., 1932 | Uncertainty assigned by TRC = 0.5 K; TRC |
Quantity | Value | Units | Method | Reference | Comment |
Tfus | 257.25 | K | N/A | Witschonke, 1954 | Metastable crystal phase; Uncertainty assigned by TRC = 1. K; TRC |
Tfus | 259.35 | K | N/A | Witschonke, 1954 | Metastable crystal phase; Uncertainty assigned by TRC = 0.35 K; TRC |
Tfus | 259.32 | K | N/A | Witschonke, 1954 | Crystal phase 1 phase; Uncertainty assigned by TRC = 0.8 K; TRC |
Tfus | 261.05 | K | N/A | Witschonke, 1954 | Crystal phase 1 phase; Uncertainty assigned by TRC = 0.3 K; TRC |
Tfus | 258.9 | K | N/A | Birch, Dean, et al., 1949 | Uncertainty assigned by TRC = 1. K; TRC |
Enthalpy of vaporization
ΔvapH (kJ/mol) | Temperature (K) | Method | Reference | Comment |
---|---|---|---|---|
61.3 ± 0.6 | 317. | N/A | Verevkin, 1997 | Based on data from 295. to 339. K.; AC |
55.5 | 398. | A | Stephenson and Malanowski, 1987 | Based on data from 383. to 485. K.; AC |
56.9 | 341. | N/A | Stull, 1947 | Based on data from 326. to 485. K.; AC |
Antoine Equation Parameters
log10(P) = A − (B / (T + C))
P = vapor pressure (bar)
T = temperature (K)
View plot Requires a JavaScript / HTML 5 canvas capable browser.
Temperature (K) | A | B | C | Reference | Comment |
---|---|---|---|---|---|
325.9 to 484.7 | 5.18072 | 2293.277 | -41.261 | Stull, 1947 | Coefficents calculated by NIST from author's data. |

Gas phase ion energetics data

Data compiled as indicated in comments:
LLK - Sharon G. Lias, Rhoda D. Levin, and Sherif A. Kafafi
RDSH - Henry M. Rosenstock, Keith Draxl, Bruce W. Steiner, and John T. Herron
Ionization energy determinations
IE (eV) | Method | Reference | Comment |
---|---|---|---|
7.4 ± 0.1 | CTS | Farrell and Newton, 1966 | RDSH |
7.65 ± 0.05 | PE | Szepes, Distefano, et al., 1974 | Vertical value; LLK |

Kovats' RI, non-polar column, isothermal

View large format table.

Column type Active phase Temperature (C) I Reference Comment
CapillaryDB-1170.1167.01Kuhn, 200130. m/0.53 mm/3. μm, He
CapillaryOV-101150.1145.7Cha and Lee, 1994Column length: 20. m; Column diameter: 0.5 mm
CapillaryOV-101180.1160.7Cha and Lee, 1994Column length: 20. m; Column diameter: 0.5 mm

Kovats' RI, polar column, isothermal

View large format table.

Column type Active phase Temperature (C) I Reference Comment
CapillaryCarbowax 20M130.1960.Hedin, Thopson, et al., 1972N2; Column length: 15.24 m; Column diameter: 0.5 mm
PackedPEG-20M210.1976.Still, Evans, et al., 1972Chromosorb G; Column length: 3. m

Van Den Dool and Kratz RI, non-polar column, temperature ramp

View large format table.

Column type Active phase I Reference Comment
CapillaryDB-11123.1Sun and Stremple, 200330. m/0.25 mm/0.25 μm, He, 3. K/min; Tstart: 40. C; Tend: 325. C
CapillaryOV-11137.7Gautzsch and Zinn, 19968. K/min; Tstart: 35. C; Tend: 300. C
CapillaryDB-51167.Rostad and Pereira, 198630. m/0.26 mm/0.25 μm, He, 50. C @ 4. min, 6. K/min, 300. C @ 20. min

Normal alkane RI, non-polar column, temperature ramp

View large format table.

Column type Active phase I Reference Comment
CapillaryUltra-11131.Okumura, 199125. m/0.32 mm/0.25 μm, He, 3. K/min; Tstart: 80. C; Tend: 260. C
CapillaryUltra-11136.Okumura, 199125. m/0.32 mm/0.25 μm, He, 3. K/min; Tstart: 80. C; Tend: 260. C

Lee's RI, non-polar column, temperature ramp

View large format table.

Column type Active phase I Reference Comment
CapillaryDB-5196.10Rostad and Pereira, 198630. m/0.26 mm/0.25 μm, He, 50. C @ 4. min, 6. K/min, 300. C @ 20. min

References

Lemoult, 1907
Lemoult, M.P.,
Recherches theoriques et experimentales sur les chaleurs de combustion et de formation des composes organiques,
Ann. Chim. Phys., 1907, 12, 395-432. [all data]
Aldrich Chemical Company Inc., 1990
Aldrich Chemical Company Inc.,
Catalog Handbook of Fine Chemicals, Aldrich Chemical Company, Inc., Milwaukee WI, 1990, 1. [all data]
Buehler, Wood, et al., 1932
Buehler, C.A.; Wood, J.H.; Hull, D.C.; Erwin, E.C.,
A Study of Molecular Organic Compounds. IV. The Molecular Organic Compounds of Phenol, their Parachors and Refractivities,
J. Am. Chem. Soc., 1932, 54, 2398. [all data]
Witschonke, 1954
Witschonke, C.R.,
Freezing point and purity data for some organic compounds,
Anal. Chem., 1954, 26, 562-4. [all data]
Birch, Dean, et al., 1949
Birch, S.F.; Dean, R.A.; Fidler, F.A.; Lowry, R.A.,
The preparation of the c(10) monocyclic aromatic hydrocarbons,
J. Am. Chem. Soc., 1949, 71, 1362. [all data]
Verevkin, 1997
Verevkin, Sergey P.,
Thermochemistry of amines: experimental standard molar enthalpies of formation of some aliphatic and aromatic amines,
The Journal of Chemical Thermodynamics, 1997, 29, 8, 891-899, https://doi.org/10.1006/jcht.1997.0212
. [all data]
Stephenson and Malanowski, 1987
Stephenson, Richard M.; Malanowski, Stanislaw,
Handbook of the Thermodynamics of Organic Compounds, 1987, https://doi.org/10.1007/978-94-009-3173-2
. [all data]
Stull, 1947
Stull, Daniel R.,
Vapor Pressure of Pure Substances. Organic and Inorganic Compounds,
Ind. Eng. Chem., 1947, 39, 4, 517-540, https://doi.org/10.1021/ie50448a022
. [all data]
Farrell and Newton, 1966
Farrell, P.G.; Newton, J.,
Ionization potentials of primary aromatic amines and aza-hydrocarbons,
Tetrahedron Lett., 1966, 5517. [all data]
Szepes, Distefano, et al., 1974
Szepes, L.; Distefano, G.; Pignataro, S.,
Steric inhibition of resonance in acetanilides by UV photoelectron spectroscopy,
Ann. Chim., 1974, 64, 159. [all data]