Diphenyl sulfoxide
- Formula: C12H10OS
- Molecular weight: 202.272
- IUPAC Standard InChIKey: JJHHIJFTHRNPIK-UHFFFAOYSA-N
- CAS Registry Number: 945-51-7
- Chemical structure:
View 3d structure (requires JavaScript / HTML 5) - Other names: Benzene, 1,1'-sulfinylbis-; Phenyl sulfoxide; Phenylsulfinylbenzene; Sulfoxide, diphenyl; Diphenyl sulphoxide

Gas phase thermochemistry data

Data compiled by: Hussein Y. Afeefy, Joel F. Liebman, and Stephen E. Stein
Quantity | Value | Units | Method | Reference | Comment |
---|---|---|---|---|---|
ΔfH°gas | 107. ± 3. | kJ/mol | Ccr | Mackle and O'Hare, 1961 |

Condensed phase thermochemistry data

Data compiled as indicated in comments:
ALS - Hussein Y. Afeefy, Joel F. Liebman, and Stephen E. Stein
DH - Eugene S. Domalski and Elizabeth D. Hearing
Quantity | Value | Units | Method | Reference | Comment |
---|---|---|---|---|---|
ΔfH°solid | 10. ± 1.0 | kJ/mol | Ccr | Mackle and O'Hare, 1961 | ALS |
Quantity | Value | Units | Method | Reference | Comment |
ΔcH°solid | -6763.4 ± 0.4 | kJ/mol | Ccr | Mackle and O'Hare, 1961 | ALS |
Constant pressure heat capacity of solid
Cp,solid (J/mol*K) | Temperature (K) | Reference | Comment |
---|---|---|---|
239.7 | 298.5 | Smith and Andrews, 1931 | T = 102 to 323 K. Value is unsmoothed experimental datum.; DH |

Phase change data

Data compiled as indicated in comments:
TRC - Thermodynamics Research Center, NIST Boulder Laboratories, Chris Muzny director
ALS - Hussein Y. Afeefy, Joel F. Liebman, and Stephen E. Stein
Quantity | Value | Units | Method | Reference | Comment |
---|---|---|---|---|---|
Tfus | 344. | K | N/A | Dyer, Harris, et al., 1982 | Uncertainty assigned by TRC = 3. K; TRC |
Tfus | 343. | K | N/A | Venier, Squires, et al., 1982 | Uncertainty assigned by TRC = 3. K; TRC |
Tfus | 342.15 | K | N/A | Smith and Andrews, 1931, 2 | Uncertainty assigned by TRC = 1.5 K; by Hg thermometer; TRC |
Tfus | 342.55 | K | N/A | Smith and Andrews, 1931, 2 | Uncertainty assigned by TRC = 0.6 K; by thermocouple; TRC |
Quantity | Value | Units | Method | Reference | Comment |
ΔsubH° | 97. ± 3. | kJ/mol | V | Mackle and O'Hare, 1961 | ALS |

Reaction thermochemistry data

Data compiled by: Robert C. Dunbar
Individual Reactions
By formula: Li+ + C12H10OS = (Li+ • C12H10OS)
Quantity | Value | Units | Method | Reference | Comment |
---|---|---|---|---|---|
ΔrH° | 234. | kJ/mol | CIDC | Buncel, Decouzon, et al., 1997 |

Gas phase ion energetics data

Data compiled as indicated in comments:
LLK - Sharon G. Lias, Rhoda D. Levin, and Sherif A. Kafafi
Ionization energy determinations
IE (eV) | Method | Reference | Comment |
---|---|---|---|
8.3 | PE | Bock and Solouki, 1974 | LLK |
9.02 ± 0.05 | EI | Distefano, Foffani, et al., 1971 | LLK |
9.02 | EI | Distefano, Foffani, et al., 1971, 2 | LLK |
8.58 | PE | Bock and Solouki, 1974 | Vertical value; LLK |

Ion clustering data

Data compiled by: Robert C. Dunbar
Clustering reactions
By formula: Li+ + C12H10OS = (Li+ • C12H10OS)
Quantity | Value | Units | Method | Reference | Comment |
---|---|---|---|---|---|
ΔrH° | 234. | kJ/mol | CIDC | Buncel, Decouzon, et al., 1997 |

References

Mackle and O'Hare, 1961
Mackle, H.; O'Hare, P.A.G.,
Studies in the thermochemistry of sulphoxides. Part 1 - The gas-phase heats of formation of diethyl, di-n-propyl, t-butyl ethyl, allyl ethyl and diphenyl sulphoxides,
Trans. Faraday Soc., 1961, 57, 2219-2224. [all data]
Smith and Andrews, 1931
Smith, R.H.; Andrews, D.H.,
Thermal energy studies. II. Phenyl derivatives of metals,
J. Am. Chem. Soc., 1931, 53, 3661-3667. [all data]
Dyer, Harris, et al., 1982
Dyer, J.C.; Harris, D.L.; Evans, S.A.,
Oxygen-17 Nulcear Magnetic RFesonacne SPtroscopy of Sulfoxides and Sulfones. Alkyl Substituent Induced Chemical Shifts,
J. Org. Chem., 1982, 47, 3660-4. [all data]
Venier, Squires, et al., 1982
Venier, C.G.; Squires, T.G.; Chen, Y. -Y; Hussmann, G.P.; Shei, J. C>; Smith, G.F.,
Peroxyfluoroacetic Acid. A Convenient Reagent for the Preparation of Sulfoxides and Sulfones,
J. Org. Chem., 1982, 47, 3773-4. [all data]
Smith and Andrews, 1931, 2
Smith, R.H.; Andrews, D.H.,
Thermal Energy Studies II. Phenyl Derivatives of Metals,
J. Am. Chem. Soc., 1931, 53, 3661-7. [all data]
Buncel, Decouzon, et al., 1997
Buncel, E.; Decouzon, M.; Formento, A.; Gal, J.-F.; Herreros, M.; Li, L.; Maria, P.-C.,
Lithium-Cation and Proton Affinities of Sulfoxides and Sulfones: A Fourier Transform Ion Cyclotron Resonance Study,
J. Am. Soc. Mass Spectrom., 1997, 8, 3, 262, https://doi.org/10.1016/S1044-0305(96)00255-3
. [all data]
Bock and Solouki, 1974
Bock, H.; Solouki, B.,
Photoelektronenspektren und molekuleigenschaften, XXXV. Sulfoxide X2SO - beispiele fur den nutzen von korrelations - diagrammen bei der diskussion von substituenteneffekten und von geometrischen storungen,
Chem. Ber., 1974, 107, 2299. [all data]
Distefano, Foffani, et al., 1971
Distefano, G.; Foffani, A.; Innorta, G.; Pignataro, S.,
Mass spectrometric study of transition metal complexes with ligands having nitrogen or sulphur as donor atom,
Adv. Mass Spectrom., 1971, 5, 696. [all data]
Distefano, Foffani, et al., 1971, 2
Distefano, G.; Foffani, A.; Innorta, G.; Pignataro, S.,
Electron impact ionization potentials of some manganese, chromium and tungsten organometallic derivatives,
Int. J. Mass Spectrom. Ion Phys., 1971, 7, 383. [all data]