Cyclohexanol, 1-ethynyl-
- Formula: C8H12O
- Molecular weight: 124.1803
- IUPAC Standard InChIKey: QYLFHLNFIHBCPR-UHFFFAOYSA-N
- CAS Registry Number: 78-27-3
- Chemical structure:
View 3d structure (requires JavaScript / HTML 5) - Other names: (1-Hydroxycyclohexyl)ethyne; 1-Ethynyl-1-cyclohexanol; 1-Ethynyl-1-hydroxycyclohexane; 1-Ethynylcyclohexan-1-ol; 1-Ethynylcyclohexanol; Ethynylcyclohexanol; 1-Hydroxy-1-ethynylcyclohexane

Phase change data

Data compiled as indicated in comments:
BS - Robert L. Brown and Stephen E. Stein
TRC - Thermodynamics Research Center, NIST Boulder Laboratories, Chris Muzny director
Quantity | Value | Units | Method | Reference | Comment |
---|---|---|---|---|---|
Tboil | 453.2 | K | N/A | Aldrich Chemical Company Inc., 1990 | BS |
Quantity | Value | Units | Method | Reference | Comment |
Tfus | 305. | K | N/A | Pinkney, Nesty, et al., 1936 | Uncertainty assigned by TRC = 3. K; TRC |
Reduced pressure boiling point
Tboil (K) | Pressure (bar) | Reference | Comment |
---|---|---|---|
347. | 0.016 | Farchan Laboratories, 1990 | BS |

Gas phase ion energetics data

Data compiled by: Sharon G. Lias, Rhoda D. Levin, and Sherif A. Kafafi
Ionization energy determinations
IE (eV) | Method | Reference | Comment |
---|---|---|---|
10.6 | PE | Andreocci, Bitchev, et al., 1979 | Vertical value |

References

Aldrich Chemical Company Inc., 1990
Aldrich Chemical Company Inc.,
Catalog Handbook of Fine Chemicals, Aldrich Chemical Company, Inc., Milwaukee WI, 1990, 1. [all data]
Pinkney, Nesty, et al., 1936
Pinkney, P.S.; Nesty, G.A.; Wiley, R.H.; Marvel, C.S.,
Hydropheanthrenes and Related Ring Systemsfrom Dieneynes,
J. Am. Chem. Soc., 1936, 58, 972. [all data]
Farchan Laboratories, 1990
Farchan Laboratories,
Research Chemicals Catalog, Farchan Laboratories, Gainesville, FL, 1990, 91. [all data]
Andreocci, Bitchev, et al., 1979
Andreocci, M.V.; Bitchev, P.; Carusi, P.; Furlani, A.,
Valence shell photoionization spectra of some substituted hydroxy-acetylenes. A tentative correlation with their cyclotrimerization reactions,
J. Electron Spectrosc. Relat. Phenom., 1979, 16, 25. [all data]