beryllium chloride
- Formula: BeCl2
- Molecular weight: 79.918
- CAS Registry Number: 7787-47-5

Gas phase ion energetics data

Data compiled as indicated in comments:
LLK - Sharon G. Lias, Rhoda D. Levin, and Sherif A. Kafafi
RDSH - Henry M. Rosenstock, Keith Draxl, Bruce W. Steiner, and John T. Herron
Ionization energy determinations
IE (eV) | Method | Reference | Comment |
---|---|---|---|
11.15 | PE | Lee and Potts, 1979 | LLK |
12.5 ± 1.0 | EI | Farber and Srivastava, 1974 | LLK |
12.4 ± 0.4 | EI | Hildenbrand and Theard, 1969 | RDSH |
12.75 ± 0.02 | PE | Lee and Potts, 1979 | Vertical value; LLK |
Appearance energy determinations
Ion | AE (eV) | Other Products | Method | Reference | Comment |
---|---|---|---|---|---|
Be+ | 20.4 ± 0.4 | ? | EI | Hildenbrand and Theard, 1969 | RDSH |
BeCl+ | 14.3 ± 0.5 | Cl | EI | Hildenbrand and Theard, 1969 | RDSH |

Vibrational and/or electronic energy levels

Data compiled by: Marilyn E. Jacox
State: X
Vib. sym. |
No. | Approximate type of mode |
cm-1 | Med. | Method | References | |
---|---|---|---|---|---|---|---|
Πu | 2 | Bend | 238 | s | Ne | IR | Snelson, 1968 |
Σu+ | 3 | Asym. stretch | 1122 | s | Ne | IR | Snelson, 1966 Snelson, 1968 |
3 | Asym. stretch | 1108 | s | Ar | IR | Snelson, 1966 | |
3 | Asym. stretch | 1100 | s | Kr | IR | Snelson, 1966 | |
Additional references: Jacox, 1994, page 84; Buchler, Stauffer, et al., 1964

Gas phase thermochemistry data

Quantity | Value | Units | Method | Reference | Comment |
---|---|---|---|---|---|
ΔfH°gas | -86.099 | kcal/mol | Review | Chase, 1998 | Data last reviewed in June, 1965 |
Quantity | Value | Units | Method | Reference | Comment |
S°gas,1 bar | 60.261 | cal/mol*K | Review | Chase, 1998 | Data last reviewed in June, 1965 |
Gas Phase Heat Capacity (Shomate Equation)
Cp° = A + B*t + C*t2 + D*t3 +
E/t2
H° − H°298.15= A*t + B*t2/2 +
C*t3/3 + D*t4/4 − E/t + F − H
S° = A*ln(t) + B*t + C*t2/2 + D*t3/3 −
E/(2*t2) + G
Cp = heat capacity (cal/mol*K)
H° = standard enthalpy (kcal/mol)
S° = standard entropy (cal/mol*K)
t = temperature (K) / 1000.
View plot Requires a JavaScript / HTML 5 canvas capable browser.
Temperature (K) | 2000. to 6000. |
---|---|
A | 13.95480 |
B | 0.780023 |
C | -0.206874 |
D | 0.017418 |
E | -0.172418 |
F | -90.87130 |
G | 75.95399 |
H | -86.10000 |
Reference | Chase, 1998 |
Comment | Data last reviewed in June, 1965 |

Condensed phase thermochemistry data

Quantity Value Units Method Reference Comment
Δfliquid-117.43kcal/molReviewChase, 1998Data last reviewed in June, 1965
Quantity Value Units Method Reference Comment
liquid,1 bar19.05cal/mol*KReviewChase, 1998Data last reviewed in June, 1965
Quantity Value Units Method Reference Comment
Δfsolid-118.60kcal/molReviewChase, 1998β phase; Data last reviewed in June, 1965

Liquid Phase Heat Capacity (Shomate Equation)

Cp° = A + B*t + C*t2 + D*t3 + E/t2
H° − H°298.15= A*t + B*t2/2 + C*t3/3 + D*t4/4 − E/t + F − H
S° = A*ln(t) + B*t + C*t2/2 + D*t3/3 − E/(2*t2) + G
    Cp = heat capacity (cal/mol*K)
    H° = standard enthalpy (kcal/mol)
    S° = standard entropy (cal/mol*K)
    t = temperature (K) / 1000.

View plot Requires a JavaScript / HTML 5 canvas capable browser.

View table.

Temperature (K) 688. - 2000.
A 29.02010
B -3.500741×10-9
C 2.427441×10-9
D -5.552469×10-10
E -1.287711×10-10
F -128.1710
G 48.53690
H -117.4270
ReferenceChase, 1998
Comment Data last reviewed in June, 1965

Solid Phase Heat Capacity (Shomate Equation)

Cp° = A + B*t + C*t2 + D*t3 + E/t2
H° − H°298.15= A*t + B*t2/2 + C*t3/3 + D*t4/4 − E/t + F − H
S° = A*ln(t) + B*t + C*t2/2 + D*t3/3 − E/(2*t2) + G
    Cp = heat capacity (cal/mol*K)
    H° = standard enthalpy (kcal/mol)
    S° = standard entropy (cal/mol*K)
    t = temperature (K) / 1000.

View plot Requires a JavaScript / HTML 5 canvas capable browser.

View table.

Temperature (K) 298. - 688.298. - 688.
A 13.74823-0.637364
B 11.5565777.89269
C -6.755737-105.1532
D 1.33010149.33843
E -0.1518300.084659
F -123.6654-119.4928
G 30.744030.474653
H -118.5999-117.3351
ReferenceChase, 1998Chase, 1998
Comment β phase; Data last reviewed in June, 1965 α phase; Data last reviewed in June, 1965

References

Lee and Potts, 1979
Lee, E.P.F.; Potts, A.W.,
An investigation of the valence shell electronic structure of alkaline earth halides by using Ab initio S. C. F. calculations and photoelectron spectroscopy,
Proc. R. Soc. London A:, 1979, 365, 395. [all data]
Farber and Srivastava, 1974
Farber, M.; Srivastava, R.D.,
Dissociation energies of BeF and BeCl and the heat of formation of BeClF,
J. Chem. Soc. Faraday Trans. 1, 1974, 70, 1581. [all data]
Hildenbrand and Theard, 1969
Hildenbrand, D.L.; Theard, L.P.,
Mass spectrometric measurement of the dissociation energies of BeCi and BeCl2,
J. Chem. Phys., 1969, 50, 5350. [all data]
Snelson, 1968
Snelson, A.,
Infrared spectra of the beryllium halides,
J. Phys. Chem., 1968, 72, 1, 250, https://doi.org/10.1021/j100847a046
. [all data]
Snelson, 1966
Snelson, A.,
Infrared Spectra of Some Alkaline Earth Halides by the Matrix Isolation Technique,
J. Phys. Chem., 1966, 70, 10, 3208, https://doi.org/10.1021/j100882a031
. [all data]
Jacox, 1994
Jacox, M.E.,
Vibrational and electronic energy levels of polyatomic transient molecules, American Chemical Society, Washington, DC, 1994, 464. [all data]
Buchler, Stauffer, et al., 1964
Buchler, A.; Stauffer, J.L.; Klemperer, W.,
None,
J. Am. Chem. Soc., 1964, 86, 21, 4544, https://doi.org/10.1021/ja01075a007
. [all data]