Isobutane
- Formula: C4H10
- Molecular weight: 58.1222
- IUPAC Standard InChIKey: NNPPMTNAJDCUHE-UHFFFAOYSA-N
- CAS Registry Number: 75-28-5
- Chemical structure:
View 3d structure (requires JavaScript / HTML 5) - Other names: Propane, 2-methyl-; Trimethylmethane; 1,1-Dimethylethane; 2-Methylpropane; iso-C4H10; i-Butane; UN 1969; R 600a; tert-Butane; A 31; Methylpropane; A 31 (hydrocarbon)

Gas phase thermochemistry data

Data compiled as indicated in comments:
ALS - Hussein Y. Afeefy, Joel F. Liebman, and Stephen E. Stein
GT - Glushko Thermocenter, Russian Academy of Sciences, Moscow
Quantity | Value | Units | Method | Reference | Comment |
---|---|---|---|---|---|
ΔfH°gas | -134.2 ± 0.63 | kJ/mol | Ccb | Pittam and Pilcher, 1972 | ALS |
ΔfH°gas | -135.6 ± 0.54 | kJ/mol | Cm | Prosen, Maron, et al., 1951 | see Prosen and Rossini, 1945, Rossini, 1935; ALS |
Quantity | Value | Units | Method | Reference | Comment |
ΔcH°gas | -2869.0 ± 0.59 | kJ/mol | Ccb | Pittam and Pilcher, 1972 | Corresponding ΔfHºgas = -134.2 kJ/mol (simple calculation by NIST; no Washburn corrections); ALS |
ΔcH°gas | -2867.6 ± 0.46 | kJ/mol | Cm | Prosen, Maron, et al., 1951 | see Prosen and Rossini, 1945, Rossini, 1935; Corresponding ΔfHºgas = -135.6 kJ/mol (simple calculation by NIST; no Washburn corrections); ALS |
Constant pressure heat capacity of gas
Cp,gas (J/mol*K) | Temperature (K) | Reference | Comment |
---|---|---|---|
34.81 | 50. | Chen S.S., 1975 | Recommended values are in good agreement with those calculated by [ Pitzer K.S., 1946].; GT |
47.28 | 100. | ||
60.29 | 150. | ||
71.84 | 200. | ||
89.91 | 273.15 | ||
96.65 | 298.15 | ||
97.15 | 300. | ||
124.43 | 400. | ||
149.24 | 500. | ||
170.37 | 600. | ||
188.28 | 700. | ||
203.64 | 800. | ||
216.94 | 900. | ||
228.45 | 1000. | ||
238.49 | 1100. | ||
247.15 | 1200. | ||
254.72 | 1300. | ||
261.29 | 1400. | ||
267.02 | 1500. |
Constant pressure heat capacity of gas
Cp,gas (J/mol*K) | Temperature (K) | Reference | Comment |
---|---|---|---|
82.30 ± 0.06 | 243.15 | Ernst G., 1970 | Other experimental values of heat capacity [ Sage B.H., 1937, Sage B.H., 1938] are less accurate, see [ Chen S.S., 1975]. Please also see Dailey B.P., 1943, Wacker P.F., 1947.; GT |
89.97 ± 0.06 | 273.15 | ||
95.21 ± 0.10 | 293.15 | ||
100.67 ± 0.10 | 313.15 | ||
106.37 ± 0.11 | 333.15 | ||
109.66 | 347.6 | ||
111.74 ± 0.11 | 353.15 | ||
112.55 | 359.4 | ||
119.62 | 387.5 | ||
137.03 | 452.5 | ||
152.93 | 520.9 | ||
161.29 | 561.7 | ||
169.70 | 605.3 | ||
185.18 | 692.7 |

Reaction thermochemistry data

Data compiled as indicated in comments:
B - John E. Bartmess
ALS - Hussein Y. Afeefy, Joel F. Liebman, and Stephen E. Stein
Individual Reactions
C4H9- + =
By formula: C4H9- + H+ = C4H10
Quantity | Value | Units | Method | Reference | Comment |
---|---|---|---|---|---|
ΔrH° | 1728. ± 8.4 | kJ/mol | Bran | DePuy, Gronert, et al., 1989 | gas phase; B |
ΔrH° | 1735. ± 20. | kJ/mol | Bran | Peerboom, Rademaker, et al., 1992 | gas phase; B |
Quantity | Value | Units | Method | Reference | Comment |
ΔrG° | 1692. ± 8.8 | kJ/mol | H-TS | DePuy, Gronert, et al., 1989 | gas phase; B |
ΔrG° | 1699. ± 21. | kJ/mol | H-TS | Peerboom, Rademaker, et al., 1992 | gas phase; B |
C4H9- + =
By formula: C4H9- + H+ = C4H10
Quantity | Value | Units | Method | Reference | Comment |
---|---|---|---|---|---|
ΔrH° | 1728. ± 8.4 | kJ/mol | Bran | DePuy, Gronert, et al., 1989 | gas phase; B |
ΔrH° | 1732. ± 8.4 | kJ/mol | Bran | DePuy, Bierbaum, et al., 1984 | gas phase; B |
Quantity | Value | Units | Method | Reference | Comment |
ΔrG° | 1697. ± 8.8 | kJ/mol | H-TS | DePuy, Gronert, et al., 1989 | gas phase; B |
Quantity | Value | Units | Method | Reference | Comment |
---|---|---|---|---|---|
ΔrH° | -117.8 ± 0.42 | kJ/mol | Chyd | Kistiakowsky, Ruhoff, et al., 1935 | gas phase; Reanalyzed by Cox and Pilcher, 1970, Original value = -118.78 ± 0.75 kJ/mol; At 355 °K; ALS |
By formula: C4H10 = C4H10
Quantity | Value | Units | Method | Reference | Comment |
---|---|---|---|---|---|
ΔrH° | -9.699 | kJ/mol | Eqk | Pines, Kvetinskas, et al., 1945 | gas phase; Heat of isomerization; ALS |

Gas phase ion energetics data

Data evaluated as indicated in comments:
HL - Edward P. Hunter and Sharon G. Lias
L - Sharon G. Lias
Data compiled as indicated in comments:
B - John E. Bartmess
LL - Sharon G. Lias and Joel F. Liebman
LLK - Sharon G. Lias, Rhoda D. Levin, and Sherif A. Kafafi
RDSH - Henry M. Rosenstock, Keith Draxl, Bruce W. Steiner, and John T. Herron
Quantity | Value | Units | Method | Reference | Comment |
---|---|---|---|---|---|
IE (evaluated) | 10.68 ± 0.11 | eV | N/A | N/A | L |
Quantity | Value | Units | Method | Reference | Comment |
Proton affinity (review) | 677.8 | kJ/mol | N/A | Hunter and Lias, 1998 | HL |
Quantity | Value | Units | Method | Reference | Comment |
Gas basicity | 671.3 | kJ/mol | N/A | Hunter and Lias, 1998 | HL |
Ionization energy determinations
IE (eV) | Method | Reference | Comment |
---|---|---|---|
10.57 | EST | Luo and Pacey, 1992 | LL |
10.74 ± 0.05 | EI | Flesch and Svec, 1973 | LLK |
10.69 | PI | Dewar and Worley, 1969 | RDSH |
10.79 | PI | Turner and Al-Joboury, 1964 | RDSH |
10.78 | PI | Al-Joboury and Turner, 1964 | RDSH |
10.57 | PI | Watanabe, Nakayama, et al., 1962 | RDSH |
~10.5 | PI | Steiner, Giese, et al., 1961 | RDSH |
11.13 | PE | Kimura, Katsumata, et al., 1981 | Vertical value; LLK |
11.0 ± 0.1 | PE | Bieri, Burger, et al., 1977 | Vertical value; LLK |
11.4 | PE | Murrell and Schmidt, 1972 | Vertical value; LLK |
Appearance energy determinations
Ion | AE (eV) | Other Products | Method | Reference | Comment |
---|---|---|---|---|---|
CH3+ | 29.4 ± 0.2 | ? | EI | Olmsted, Street, et al., 1964 | RDSH |
C2H5+ | 13.80 | C2H5 | EI | Omura, 1961 | RDSH |
C3H5+ | 14.55 | ? | EI | Omura, 1961 | RDSH |
C3H6+ | 10.89 ± 0.02 | CH4 | PI | Mead, Donchi, et al., 1980 | LLK |
C3H6+ | 10.91 | CH4 | EI | Wolkoff and Holmes, 1978 | LLK |
C3H6+ | 10.93 ± 0.03 | CH4 | PI | Steiner, Giese, et al., 1961 | RDSH |
C3H7+ | 11.16 ± 0.02 | CH3 | PI | Mead, Donchi, et al., 1980 | LLK |
C3H7+ | 11.16 ± 0.05 | CH3 | EI | Williams and Hamill, 1968 | RDSH |
C3H7+ | 11.23 ± 0.03 | CH3 | PI | Steiner, Giese, et al., 1961 | RDSH |
C4H9+ | 10.68 ± 0.02 | H | PI | Mead, Donchi, et al., 1980 | LLK |
C4H9+ | 10.68 ± 0.03 | H | PI | McLoughlin and Traeger, 1979 | LLK |
C4H9+ | 11.6 | H | EI | Omura, 1961 | RDSH |
De-protonation reactions
C4H9- + =
By formula: C4H9- + H+ = C4H10
Quantity | Value | Units | Method | Reference | Comment |
---|---|---|---|---|---|
ΔrH° | 1728. ± 8.4 | kJ/mol | Bran | DePuy, Gronert, et al., 1989 | gas phase; B |
ΔrH° | 1735. ± 20. | kJ/mol | Bran | Peerboom, Rademaker, et al., 1992 | gas phase; B |
Quantity | Value | Units | Method | Reference | Comment |
ΔrG° | 1692. ± 8.8 | kJ/mol | H-TS | DePuy, Gronert, et al., 1989 | gas phase; B |
ΔrG° | 1699. ± 21. | kJ/mol | H-TS | Peerboom, Rademaker, et al., 1992 | gas phase; B |
C4H9- + =
By formula: C4H9- + H+ = C4H10
Quantity | Value | Units | Method | Reference | Comment |
---|---|---|---|---|---|
ΔrH° | 1728. ± 8.4 | kJ/mol | Bran | DePuy, Gronert, et al., 1989 | gas phase; B |
ΔrH° | 1732. ± 8.4 | kJ/mol | Bran | DePuy, Bierbaum, et al., 1984 | gas phase; B |
Quantity | Value | Units | Method | Reference | Comment |
ΔrG° | 1697. ± 8.8 | kJ/mol | H-TS | DePuy, Gronert, et al., 1989 | gas phase; B |

Condensed phase thermochemistry data

Data compiled by: Eugene S. Domalski and Elizabeth D. Hearing
Quantity | Value | Units | Method | Reference | Comment |
---|---|---|---|---|---|
S°liquid | 47.990 | cal/mol*K | N/A | Aston, Kennedy, et al., 1940 | |
S°liquid | 47.49 | cal/mol*K | N/A | Parks, Shomate, et al., 1937 | Extrapolation below 67 K, 44.02 J/mol*K. |
Constant pressure heat capacity of liquid
Cp,liquid (cal/mol*K) | Temperature (K) | Reference | Comment |
---|---|---|---|
30.999 | 260. | Aston, Kennedy, et al., 1940 | T = 20 to 260 K. |
30.69 | 258.3 | Parks, Shomate, et al., 1937 | T = 79 to 261 K. Value is unsmoothed experimental datum. |

Phase change data

Data compiled as indicated in comments:
BS - Robert L. Brown and Stephen E. Stein
TRC - Thermodynamics Research Center, NIST Boulder Laboratories, Chris Muzny director
DH - Eugene S. Domalski and Elizabeth D. Hearing
AC - William E. Acree, Jr., James S. Chickos
ALS - Hussein Y. Afeefy, Joel F. Liebman, and Stephen E. Stein
Quantity | Value | Units | Method | Reference | Comment |
---|---|---|---|---|---|
Tboil | 262. ± 2. | K | AVG | N/A | Average of 24 out of 25 values; Individual data points |
Quantity | Value | Units | Method | Reference | Comment |
Tfus | 140. ± 100. | K | AVG | N/A | Average of 7 values; Individual data points |
Quantity | Value | Units | Method | Reference | Comment |
Ttriple | 113.55 | K | N/A | Younglove and Ely, 1987 | Uncertainty assigned by TRC = 0.05 K; TRC |
Ttriple | 113.55 | K | N/A | Goodwin and Haynes, 1982 | Uncertainty assigned by TRC = 0.02 K; TRC |
Ttriple | 113.74 | K | N/A | Aston, Kennedy, et al., 1940, 2 | Uncertainty assigned by TRC = 0.07 K; TRC |
Ttriple | 113.2 | K | N/A | Parks, Shomate, et al., 1937, 2 | Uncertainty assigned by TRC = 0.2 K; TRC |
Quantity | Value | Units | Method | Reference | Comment |
Ptriple | 1.9226×10-7 | atm | N/A | Younglove and Ely, 1987 | Uncertainty assigned by TRC = 2.×10-10 atm; TRC |
Ptriple | 1.9226×10-7 | atm | N/A | Goodwin and Haynes, 1982 | Uncertainty assigned by TRC = 5.×10-10 atm; TRC |
Quantity | Value | Units | Method | Reference | Comment |
Tc | 407.7 ± 0.8 | K | AVG | N/A | Average of 10 values; Individual data points |
Quantity | Value | Units | Method | Reference | Comment |
Pc | 36.0 ± 0.5 | atm | AVG | N/A | Average of 9 values; Individual data points |
Quantity | Value | Units | Method | Reference | Comment |
Vc | 0.259 | l/mol | N/A | Daubert, 1996 | |
Vc | 0.2591 | l/mol | N/A | Younglove and Ely, 1987 | Uncertainty assigned by TRC = 0.001 l/mol; TRC |
Quantity | Value | Units | Method | Reference | Comment |
ρc | 3.85 ± 0.05 | mol/l | N/A | Daubert, 1996 | |
ρc | 3.880 | mol/l | N/A | Levelt Sengers, Kamgar-Parsi, et al., 1983 | Uncertainty assigned by TRC = 0.009 mol/l; TRC |
ρc | 3.91 | mol/l | N/A | Waxman and Gallagher, 1983 | Uncertainty assigned by TRC = 0.09 mol/l; TRC |
ρc | 3.8601 | mol/l | N/A | Goodwin and Haynes, 1982 | Uncertainty assigned by TRC = 0.03 mol/l; TRC |
ρc | 3.802 | mol/l | N/A | Beattie, Edwards, et al., 1949 | Uncertainty assigned by TRC = 0.1 mol/l; TRC |
Quantity | Value | Units | Method | Reference | Comment |
ΔvapH° | 4.778 | kcal/mol | N/A | Majer and Svoboda, 1985 |
Enthalpy of vaporization
ΔvapH (kcal/mol) | Temperature (K) | Method | Reference | Comment |
---|---|---|---|---|
5.0901 | 261.44 | N/A | Aston, Kennedy, et al., 1940 | P = 101.325 kPa; DH |
5.09 | 261.3 | N/A | Majer and Svoboda, 1985 | |
5.14 | 318. | N/A | Lim, Park, et al., 1999 | Based on data from 303. to 333. K.; AC |
5.35 | 265. | A | Stephenson and Malanowski, 1987 | Based on data from 186. to 280. K.; AC |
6.43 | 172. | A | Stephenson and Malanowski, 1987 | Based on data from 121. to 187. K.; AC |
5.23 | 278. | A | Stephenson and Malanowski, 1987 | Based on data from 263. to 306. K.; AC |
5.11 | 316. | A | Stephenson and Malanowski, 1987 | Based on data from 301. to 366. K.; AC |
5.16 | 376. | A | Stephenson and Malanowski, 1987 | Based on data from 361. to 408. K.; AC |
5.16 | 292. | N/A | Steele, Poling, et al., 1976 | Based on data from 277. to 344. K. See also Boublik, Fried, et al., 1984.; AC |
5.09 | 286. | N/A | Reid, 1972 | AC |
5.1 ± 0.8 | 261.44 | V | Aston, Kennedy, et al., 1940, 3 | ALS |
5.40 | 247. | N/A | Aston, Kennedy, et al., 1940 | Based on data from 188. to 262. K. See also Boublik, Fried, et al., 1984.; AC |
Entropy of vaporization
ΔvapS (cal/mol*K) | Temperature (K) | Reference | Comment |
---|---|---|---|
19.47 | 261.44 | Aston, Kennedy, et al., 1940 | P; DH |
Antoine Equation Parameters
log10(P) = A − (B / (T + C))
P = vapor pressure (atm)
T = temperature (K)
View plot Requires a JavaScript / HTML 5 canvas capable browser.
Temperature (K) | A | B | C | Reference | Comment |
---|---|---|---|---|---|
261.31 to 408.12 | 4.3224 | 1132.108 | 0.918 | Das, Reed, et al., 1973 | Coefficents calculated by NIST from author's data. |
188.06 to 261.54 | 3.93846 | 912.141 | -29.808 | Aston, Kennedy, et al., 1940 | Coefficents calculated by NIST from author's data. |
Enthalpy of fusion
ΔfusH (kcal/mol) | Temperature (K) | Reference | Comment |
---|---|---|---|
1.085 | 113.74 | Aston, Kennedy, et al., 1940 | DH |
1.07 | 113.7 | Perkins and Magee, 2009 | AC |
1.09 | 113.7 | Domalski and Hearing, 1996 | AC |
1.075 | 113.2 | Parks, Shomate, et al., 1937 | DH |
Entropy of fusion
ΔfusS (cal/mol*K) | Temperature (K) | Reference | Comment |
---|---|---|---|
9.541 | 113.74 | Aston, Kennedy, et al., 1940 | DH |
9.496 | 113.2 | Parks, Shomate, et al., 1937 | DH |

Henry's Law data

Data compiled by: Rolf Sander
Henry's Law constant (water solution)
kH(T) = k°H exp(d(ln(kH))/d(1/T) ((1/T) - 1/(298.15 K)))
k°H = Henry's law constant for solubility in water at 298.15 K (mol/(kg*bar))
d(ln(kH))/d(1/T) = Temperature dependence constant (K)
k°H (mol/(kg*bar)) | d(ln(kH))/d(1/T) (K) | Method | Reference | Comment |
---|---|---|---|---|
0.00086 | Q | N/A | missing citation give several references for the Henry's law constants but don't assign them to specific species. | |
0.00084 | L | N/A | ||
0.00081 | 2700. | L | N/A | |
0.00085 | V | N/A |

Normal alkane RI, non-polar column, temperature ramp

Data compiled by: NIST Mass Spectrometry Data Center, William E. Wallace, director

Column type CapillaryCapillaryCapillaryCapillaryCapillary
Active phase Polydimethyl siloxane: CP-Sil 5 CBPetrocol DHPONAOV-1BP-1
Column length (m) 60.100.50.100.50.
Carrier gas HeliumHeliumNitrogenHeliumHe
Substrate
Column diameter (mm) 0.250.250.200.320.22
Phase thickness (μm) 1.00.500.500.250.75
Tstart (C) 45.20.35.30.50.
Tend (C) 210.220.200.310.200.
Heat rate (K/min) 3.615.2.5.5.
Initial hold (min) 1.4515.15.
Final hold (min) 2.7230.10.5.
I 359.354.354.354.8364.
ReferenceBramston-Cook, 2013Supelco, 2012Zhang, Ding, et al., 2009Krkosova, Kubinec, et al., 2007Health Safety Executive, 2000
Comment MSDC-RI MSDC-RI MSDC-RI MSDC-RI MSDC-RI
Column type Capillary
Active phase DB-1
Column length (m) 60.
Carrier gas He
Substrate
Column diameter (mm) 0.32
Phase thickness (μm) 1.2
Tstart (C) 30.
Tend (C) 240.
Heat rate (K/min) 3.
Initial hold (min) 10.
Final hold (min)
I 355.
ReferenceCiccioli, Cecinato, et al., 1992
Comment MSDC-RI

Van Den Dool and Kratz RI, non-polar column, temperature ramp

Data compiled by: NIST Mass Spectrometry Data Center, William E. Wallace, director

Column type CapillaryCapillaryCapillaryCapillaryCapillary
Active phase OV-101Petrocol DHPetrocol DHPetrocol DHPetrocol DH
Column length (m) 80.100.100.100.100.
Carrier gas N2HeHeHeHe
Substrate
Column diameter (mm) 0.220.250.250.250.25
Phase thickness (μm)  0.50.50.50.5
Tstart (C) 30.30.30.30.30.
Tend (C) 130.220.220.220.220.
Heat rate (K/min) 1.1.1.1.1.
Initial hold (min)
Final hold (min)
I 354.2353.99353.53353.53353.
ReferenceYin, Liu, et al., 2001Subramaniam, Bochniak, et al., 1994White, Douglas, et al., 1992White, Douglas, et al., 1992White, Hackett, et al., 1992
Comment MSDC-RI MSDC-RI MSDC-RI MSDC-RI MSDC-RI

Kovats' RI, non-polar column, custom temperature program

Data compiled by: NIST Mass Spectrometry Data Center, William E. Wallace, director

Column type CapillaryCapillary
Active phase Petrocol DH-100DB-1
Column length (m) 100.60.
Carrier gas HeHe
Substrate
Column diameter (mm) 0.20.32
Phase thickness (μm)  1.0
Program 5C(10min) => 5C/min => 50C(48min) => 1.5C/min => 195C(91min)-40 C for 12 min; -40 - 125 C at 3 deg.min; 125-185 C at 6 deg/min; 185 - 220 C at 20 deg/min; hold 220 C for 2 min
I 366.362.
ReferenceHaagen-Smit Laboratory, 1997Hoekman, 1993
Comment MSDC-RI MSDC-RI

References

Pittam and Pilcher, 1972
Pittam, D.A.; Pilcher, G.,
Measurements of heats of combustion by flame calorimetry. Part 8.-Methane, ethane, propane, n-butane and 2-methylpropane,
J. Chem. Soc. Faraday Trans. 1, 1972, 68, 2224-2229. [all data]
Prosen, Maron, et al., 1951
Prosen, E.J.; Maron, F.W.; Rossini, F.D.,
Heats of combustion, formation, and insomerization of ten C4 hydrocarbons,
J. Res. NBS, 1951, 46, 106-112. [all data]
Prosen and Rossini, 1945
Prosen, E.J.; Rossini, F.D.,
Heats of formation and combustion of 1,3-butadiene and styrene,
J. Res. NBS, 1945, 34, 59-63. [all data]
Rossini, 1935
Rossini, F.D.,
Heat of combustion of isobutane,
J. Res. NBS, 1935, 15, 357-361. [all data]
Chen S.S., 1975
Chen S.S.,
Ideal gas thermodynamic properties and isomerization of n-butane and isobutane,
J. Phys. Chem. Ref. Data, 1975, 4, 859-869. [all data]
Pitzer K.S., 1946
Pitzer K.S.,
The entropies and related properties of branched paraffin hydrocarbons,
Chem. Rev., 1946, 39, 435-447. [all data]
Ernst G., 1970
Ernst G.,
Ideal and real gas state heat capacities Cp of C3H8, i-C4H10, C2F5Cl, CH2ClCF3, CF2ClCFCl2, and CHF2Cl,
J. Chem. Thermodyn., 1970, 2, 787-791. [all data]
Sage B.H., 1937
Sage B.H.,
Phase equilibria in hydrocarbon systems. XX. Isobaric heat capacity of gaseous propane, n-butane, isobutane, and n-pentane,
Ind. Eng. Chem., 1937, 29, 1309-1314. [all data]
Sage B.H., 1938
Sage B.H.,
Phase equilibrium in hydrocarbon systems. Thermodynamic properties of isobutane,
Ind. Eng. Chem., 1938, 30, 673-681. [all data]
Dailey B.P., 1943
Dailey B.P.,
Heat capacities and hindered rotation in n-butane and isobutane,
J. Am. Chem. Soc., 1943, 65, 44-46. [all data]
Wacker P.F., 1947
Wacker P.F.,
Heat capacities of gaseous oxygen, isobutane, and 1-butene from -30 to +90 C,
J. Res. Nat. Bur. Stand., 1947, 38, 651-659. [all data]
DePuy, Gronert, et al., 1989
DePuy, C.H.; Gronert, S.; Barlow, S.E.; Bierbaum, V.M.; Damrauer, R.,
The Gas Phase Acidities of the Alkanes,
J. Am. Chem. Soc., 1989, 111, 6, 1968, https://doi.org/10.1021/ja00188a003
. [all data]
Peerboom, Rademaker, et al., 1992
Peerboom, R.A.L.; Rademaker, G.J.; Dekoning, L.J.; Nibbering, N.M.M.,
Stabilization of Cycloalkyl Carbanions in the Gas Phase,
Rapid Commun. Mass Spectrom., 1992, 6, 6, 394, https://doi.org/10.1002/rcm.1290060608
. [all data]
DePuy, Bierbaum, et al., 1984
DePuy, C.H.; Bierbaum, V.M.; Damrauer, R.,
Relative Gas-Phase Acidities of the Alkanes,
J. Am. Chem. Soc., 1984, 106, 4051. [all data]
Kistiakowsky, Ruhoff, et al., 1935
Kistiakowsky, G.B.; Ruhoff, J.R.; Smith, H.A.; Vaughan, W.E.,
Heats of organic reactions. II. Hydrogenation of some simpler olefinic hydrocarbons,
J. Am. Chem. Soc., 1935, 57, 876-882. [all data]
Cox and Pilcher, 1970
Cox, J.D.; Pilcher, G.,
Thermochemistry of Organic and Organometallic Compounds, Academic Press, New York, 1970, 1-636. [all data]
Pines, Kvetinskas, et al., 1945
Pines, H.; Kvetinskas, B.; Kassel, L.S.; Ipatieff, V.N.,
Determination of equilibrium constants for butanes and pentanes,
J. Am. Chem. Soc., 1945, 67, 631-637. [all data]
Hunter and Lias, 1998
Hunter, E.P.; Lias, S.G.,
Evaluated Gas Phase Basicities and Proton Affinities of Molecules: An Update,
J. Phys. Chem. Ref. Data, 1998, 27, 3, 413-656, https://doi.org/10.1063/1.556018
. [all data]
Luo and Pacey, 1992
Luo, Y.-R.; Pacey, P.D.,
Effects of alkyl substitution on ionization energies of alkanes and haloalkanes and on heats of formation of their molecular cations. Part 2. Alkanes and chloro-, bromo- and iodoalkanes,
Int. J. Mass Spectrom. Ion Processes, 1992, 112, 63. [all data]
Flesch and Svec, 1973
Flesch, G.D.; Svec, H.J.,
Fragmentation reactions in the mass spectrometer for C2-C5 alkanes,
J. Chem. Soc. Faraday Trans. 2, 1973, 69, 1187. [all data]
Dewar and Worley, 1969
Dewar, M.J.S.; Worley, S.D.,
Photoelectron spectra of molecules. I. Ionization potentials of some organic molecules and their interpretation,
J. Chem. Phys., 1969, 50, 654. [all data]
Turner and Al-Joboury, 1964
Turner, D.W.; Al-Joboury, M.I.,
Molecular photoelectron spectroscopy,
Bull. Soc. Chim. Belges, 1964, 73, 428. [all data]
Al-Joboury and Turner, 1964
Al-Joboury, M.I.; Turner, D.W.,
Molecular photoelectron spectroscopy. Part II. A summary of ionization potentials,
J. Chem. Soc., 1964, 4434. [all data]
Watanabe, Nakayama, et al., 1962
Watanabe, K.; Nakayama, T.; Mottl, J.,
Ionization potentials of some molecules,
J. Quant. Spectry. Radiative Transfer, 1962, 2, 369. [all data]
Steiner, Giese, et al., 1961
Steiner, B.; Giese, C.F.; Inghram, M.G.,
Photoionization of alkanes. Dissociation of excited molecular ions,
J. Chem. Phys., 1961, 34, 189. [all data]
Kimura, Katsumata, et al., 1981
Kimura, K.; Katsumata, S.; Achiba, Y.; Yamazaki, T.; Iwata, S.,
Ionization energies, Ab initio assignments, and valence electronic structure for 200 molecules
in Handbook of HeI Photoelectron Spectra of Fundamental Organic Compounds, Japan Scientific Soc. Press, Tokyo, 1981. [all data]
Bieri, Burger, et al., 1977
Bieri, G.; Burger, F.; Heilbronner, E.; Maier, J.P.,
Valence ionization enrgies of hydrocarbons,
Helv. Chim. Acta, 1977, 60, 2213. [all data]
Murrell and Schmidt, 1972
Murrell, J.N.; Schmidt, W.,
Photoelectron spectroscopic correlation of the molecular orbitals of methane, ethane, propane, isobutane and neopentane,
J. Chem. Soc. Faraday Trans. 2, 1972, 68, 1709. [all data]
Olmsted, Street, et al., 1964
Olmsted, J., III; Street, K., Jr.; Newton, A.S.,
Excess-kinetic-energy ions in organic mass spectra,
J. Chem. Phys., 1964, 40, 2114. [all data]
Omura, 1961
Omura, I.,
Mass spectra at low ionizing voltage and bond dissociation energies of molecular ions from hydrocarbons,
Bull. Chem. Soc. Japan, 1961, 34, 1227. [all data]
Mead, Donchi, et al., 1980
Mead, P.T.; Donchi, K.F.; Traeger, J.C.; Christie, J.R.; Derrick, P.J.,
Secondary hydrogen isotope effect in the unimolecular decomposition of 2-methylpropane radical cations,
J. Am. Chem. Soc., 1980, 102, 3364. [all data]
Wolkoff and Holmes, 1978
Wolkoff, P.; Holmes, J.L.,
Fragmentations of alkane molecular ions,
J. Am. Chem. Soc., 1978, 100, 7346. [all data]
Williams and Hamill, 1968
Williams, J.M.; Hamill, W.H.,
Ionization potentials of molecules and free radicals and appearance potentials by electron impact in the mass spectrometer,
J. Chem. Phys., 1968, 49, 4467. [all data]
McLoughlin and Traeger, 1979
McLoughlin, R.G.; Traeger, J.C.,
Heat of formation for tert-butyl cation in the gas phase,
J. Am. Chem. Soc., 1979, 101, 5791. [all data]