Formamide, N,N-dimethyl-
- Formula: C3H7NO
- Molecular weight: 73.0938
- IUPAC Standard InChIKey: ZMXDDKWLCZADIW-UHFFFAOYSA-N
- CAS Registry Number: 68-12-2
- Chemical structure:
View 3d structure (requires JavaScript / HTML 5) - Other names: Dimethylformamide; DMF; DMF (amide); DMFA; N-Formyldimethylamine; N,N-Dimethylformamide; HCON(CH3)2; Formyldimethylamine; Dimethylforamide; Dimethylformamid; Dimetilformamide; Dwumetyloformamid; N,N-Dimethylmethanamide; NSC-5356; U-4224; Dimethylamid kyseliny mravenci; Dimetylformamidu; NCI-C60913; UN 2265; DMF (dimethylformamide); N,N-Dimethylformaldehyde

Condensed phase thermochemistry data

Data compiled as indicated in comments:
ALS - Hussein Y. Afeefy, Joel F. Liebman, and Stephen E. Stein
DH - Eugene S. Domalski and Elizabeth D. Hearing
Quantity | Value | Units | Method | Reference | Comment |
---|---|---|---|---|---|
ΔfH°liquid | -239.4 ± 1.2 | kJ/mol | Ccb | Vasil'eva, Zhil'tsova, et al., 1972 | ALS |
ΔfH°liquid | -239.0 | kJ/mol | Ccb | Medard and Thomas, 1957 | Heat of combustion corrected for pressure; ALS |
Quantity | Value | Units | Method | Reference | Comment |
ΔcH°liquid | -1941.6 ± 1.2 | kJ/mol | Ccb | Vasil'eva, Zhil'tsova, et al., 1972 | ALS |
ΔcH°liquid | -1941.9 | kJ/mol | Ccb | Medard and Thomas, 1957 | Heat of combustion corrected for pressure; ALS |
Constant pressure heat capacity of liquid
Cp,liquid (J/mol*K) | Temperature (K) | Reference | Comment |
---|---|---|---|
146.05 | 298.15 | Grolier, Roux-Desgranges, et al., 1993 | DH |
148.16 | 298.15 | Kolker, Kulikov, et al., 1992 | T = 283 to 323 K.; DH |
149.28 | 308. | Kulikov, Krestov, et al., 1989 | DH |
150.0 | 298.15 | Petrov, Peshekhodov, et al., 1989 | T = 258.15, 278.15, 298.15, 318.15 K.; DH |
148.36 | 298.15 | Zegers and Somsen, 1984 | DH |
150.5 | 298.15 | Vorob'ev and Yakovlev, 1982 | T = 297.15 to 299.15 K. Cp given as 2.059 J/g*K.; DH |
150.8 | 298.15 | de Visser and Somsen, 1979 | DH |
120.5 | 298. | Marchidan and Ciopec, 1978 | T = 298 to 427 K. Mean value over range.; DH |
148. | 298.15 | De Visser, Perron, et al., 1977 | DH |
148. | 298. | De Visser, Perron, et al., 1977 | One temperature only.; DH |
150.8 | 298.15 | De Visser, Perron, et al., 1977, 2 | DH |
146. | 298.15 | Bonner and Cerutti, 1976 | DH |
152.0 | 298.15 | de Visser and Somsen, 1974 | DH |
156.69 | 298. | Geller, 1961 | T = 273 to 323 K.; DH |

Phase change data

Data compiled as indicated in comments:
TRC - Thermodynamics Research Center, NIST Boulder Laboratories, Chris Muzny director
BS - Robert L. Brown and Stephen E. Stein
AC - William E. Acree, Jr., James S. Chickos
ALS - Hussein Y. Afeefy, Joel F. Liebman, and Stephen E. Stein
DH - Eugene S. Domalski and Elizabeth D. Hearing
Quantity | Value | Units | Method | Reference | Comment |
---|---|---|---|---|---|
Tboil | 426. ± 1. | K | AVG | N/A | Average of 8 values; Individual data points |
Quantity | Value | Units | Method | Reference | Comment |
Tfus | 212.7 | K | N/A | Dreisbach, 1955 | Uncertainty assigned by TRC = 0.02 K; TRC |
Quantity | Value | Units | Method | Reference | Comment |
Tc | 649.6 | K | N/A | Teja and Anselme, 1990 | Uncertainty assigned by TRC = 0.6 K; TRC |
Quantity | Value | Units | Method | Reference | Comment |
ρc | 3.82 | mol/l | N/A | Teja and Anselme, 1990 | Uncertainty assigned by TRC = 0.08 mol/l; TRC |
Quantity | Value | Units | Method | Reference | Comment |
ΔvapH° | 46.7 ± 0.5 | kJ/mol | CGC | Panneerselvam, Antony, et al., 2009 | Based on data from 463. to 513. K.; AC |
ΔvapH° | 46.9 | kJ/mol | A | Barone, Castronuovo, et al., 1985 | See also Majer and Svoboda, 1985.; AC |
ΔvapH° | 47.57 | kJ/mol | E | Geller, 1961, 2 | ALS |
Enthalpy of vaporization
ΔvapH (kJ/mol) | Temperature (K) | Method | Reference | Comment |
---|---|---|---|---|
43.1 | 361. | N/A | Muñoz, Montón, et al., 2005 | Based on data from 346. to 425. K.; AC |
41.8 | 392. | N/A | Blanco, Beltrán, et al., 1997 | Based on data from 377. to 426. K.; AC |
43.6 | 353. | N/A | Marzal, Gabaldon, et al., 1995 | Based on data from 338. to 425. K.; AC |
49.2 | 316. | A | Stephenson and Malanowski, 1987 | Based on data from 301. to 426. K.; AC |
42.5 | 370. | N/A | Bludilina, Baev, et al., 1979 | Based on data from 318. to 423. K.; AC |
56.7 | 346. | N/A | Myasinkova, Schmelev, et al., 1974 | Based on data from 331. to 425. K. See also Boublik, Fried, et al., 1984.; AC |
46.7 | 318. | N/A | Gopal and Rizvi, 1968 | Based on data from 303. to 363. K.; AC |
Antoine Equation Parameters
log10(P) = A − (B / (T + C))
P = vapor pressure (bar)
T = temperature (K)
View plot Requires a JavaScript / HTML 5 canvas capable browser.
Temperature (K) | A | B | C | Reference | Comment |
---|---|---|---|---|---|
303. to 363. | 3.93068 | 1337.716 | -82.648 | Gopal and Rizvi, 1968, 2 | Coefficents calculated by NIST from author's data. |
Enthalpy of fusion
ΔfusH (kJ/mol) | Temperature (K) | Method | Reference | Comment |
---|---|---|---|---|
8.950 | 212.85 | N/A | Karyakin, Rabinovich, et al., 1978 | DH |
8.95 | 212.9 | AC | Smirnova, Tsvetkova, et al., 2007 | AC |
8.95 | 212.9 | N/A | Domalski and Hearing, 1996 | AC |
Entropy of fusion
ΔfusS (J/mol*K) | Temperature (K) | Reference | Comment |
---|---|---|---|
41.8 | 212.85 | Karyakin, Rabinovich, et al., 1978 | DH |

Reaction thermochemistry data

Data compiled as indicated in comments:
B - John E. Bartmess
M - Michael M. Meot-Ner (Mautner) and Sharon G. Lias
RCD - Robert C. Dunbar
Individual Reactions
By formula: C7H7NO3- + C3H7NO = (C7H7NO3- • C3H7NO)
Quantity | Value | Units | Method | Reference | Comment |
---|---|---|---|---|---|
ΔrG° | 25. ± 6.7 | kJ/mol | IMRE | Chowdhury, Grimsrud, et al., 1987 | gas phase; Free energy affinity at 70°C.; B |
Free energy of reaction
ΔrG° (kJ/mol) | T (K) | Method | Reference | Comment |
---|---|---|---|---|
25. | 343. | PHPMS | Chowdhury, 1987 | gas phase; M |
25. | 343. | PHPMS | Chowdhury, 1987 | gas phase; M |
By formula: C6H5NO2- + C3H7NO = (C6H5NO2- • C3H7NO)
Quantity | Value | Units | Method | Reference | Comment |
---|---|---|---|---|---|
ΔrG° | 26. ± 6.7 | kJ/mol | IMRE | Chowdhury, Grimsrud, et al., 1987 | gas phase; Free energy affinity at 70°C.; B |
Free energy of reaction
ΔrG° (kJ/mol) | T (K) | Method | Reference | Comment |
---|---|---|---|---|
26. | 343. | PHPMS | Chowdhury, 1987 | gas phase; M |
By formula: C7H4N2O2- + C3H7NO = (C7H4N2O2- • C3H7NO)
Quantity | Value | Units | Method | Reference | Comment |
---|---|---|---|---|---|
ΔrG° | 16. ± 6.7 | kJ/mol | IMRE | Chowdhury, Grimsrud, et al., 1987 | gas phase; Free energy affinity at 70°C.; B |
Free energy of reaction
ΔrG° (kJ/mol) | T (K) | Method | Reference | Comment |
---|---|---|---|---|
16. | 343. | PHPMS | Chowdhury, 1987 | gas phase; M |
By formula: C6H4FNO2- + C3H7NO = (C6H4FNO2- • C3H7NO)
Quantity | Value | Units | Method | Reference | Comment |
---|---|---|---|---|---|
ΔrG° | 25. ± 6.7 | kJ/mol | IMRE | Chowdhury, Grimsrud, et al., 1987 | gas phase; Free energy affinity at 70°C.; B |
Free energy of reaction
ΔrG° (kJ/mol) | T (K) | Method | Reference | Comment |
---|---|---|---|---|
25. | 343. | PHPMS | Chowdhury, 1987 | gas phase; M |
By formula: C6H4FNO2- + C3H7NO = (C6H4FNO2- • C3H7NO)
Quantity | Value | Units | Method | Reference | Comment |
---|---|---|---|---|---|
ΔrG° | 25. ± 6.7 | kJ/mol | IMRE | Chowdhury, Grimsrud, et al., 1987 | gas phase; Free energy affinity at 70°C.; B |
Free energy of reaction
ΔrG° (kJ/mol) | T (K) | Method | Reference | Comment |
---|---|---|---|---|
25. | 343. | PHPMS | Chowdhury, 1987 | gas phase; M |
By formula: C6H4FNO2- + C3H7NO = (C6H4FNO2- • C3H7NO)
Quantity | Value | Units | Method | Reference | Comment |
---|---|---|---|---|---|
ΔrG° | 23. ± 6.7 | kJ/mol | IMRE | Chowdhury, Grimsrud, et al., 1987 | gas phase; Free energy affinity at 70°C.; B |
Free energy of reaction
ΔrG° (kJ/mol) | T (K) | Method | Reference | Comment |
---|---|---|---|---|
23. | 343. | PHPMS | Chowdhury, 1987 | gas phase; M |
By formula: C7H7NO3- + C3H7NO = (C7H7NO3- • C3H7NO)
Quantity | Value | Units | Method | Reference | Comment |
---|---|---|---|---|---|
ΔrG° | 26. ± 6.7 | kJ/mol | IMRE | Chowdhury, Grimsrud, et al., 1987 | gas phase; Free energy affinity at 70°C.; B |
Free energy of reaction
ΔrG° (kJ/mol) | T (K) | Method | Reference | Comment |
---|---|---|---|---|
26. | 343. | PHPMS | Chowdhury, 1987 | gas phase; M |
By formula: C7H7NO2- + C3H7NO = (C7H7NO2- • C3H7NO)
Quantity | Value | Units | Method | Reference | Comment |
---|---|---|---|---|---|
ΔrG° | 26. ± 6.7 | kJ/mol | IMRE | Chowdhury, Grimsrud, et al., 1987 | gas phase; Free energy affinity at 70°C.; B |
Free energy of reaction
ΔrG° (kJ/mol) | T (K) | Method | Reference | Comment |
---|---|---|---|---|
26. | 343. | PHPMS | Chowdhury, 1987 | gas phase; M |
By formula: C6H4N2O4- + C3H7NO = (C6H4N2O4- • C3H7NO)
Quantity | Value | Units | Method | Reference | Comment |
---|---|---|---|---|---|
ΔrG° | 10. ± 6.7 | kJ/mol | IMRE | Chowdhury, Grimsrud, et al., 1987 | gas phase; Free energy affinity at 70°C.; B |
Free energy of reaction
ΔrG° (kJ/mol) | T (K) | Method | Reference | Comment |
---|---|---|---|---|
10. | 343. | PHPMS | Chowdhury, 1987 | gas phase; M |
By formula: C6H4N2O4- + C3H7NO = (C6H4N2O4- • C3H7NO)
Quantity | Value | Units | Method | Reference | Comment |
---|---|---|---|---|---|
ΔrG° | 19. ± 6.7 | kJ/mol | IMRE | Chowdhury, Grimsrud, et al., 1987 | gas phase; Free energy affinity at 70°C.; B |
Free energy of reaction
ΔrG° (kJ/mol) | T (K) | Method | Reference | Comment |
---|---|---|---|---|
19. | 343. | PHPMS | Chowdhury, 1987 | gas phase; M |
By formula: C7H7NO2- + C3H7NO = (C7H7NO2- • C3H7NO)
Quantity | Value | Units | Method | Reference | Comment |
---|---|---|---|---|---|
ΔrG° | 26. ± 6.7 | kJ/mol | IMRE | Chowdhury, Grimsrud, et al., 1987 | gas phase; Free energy affinity at 70°C.; B |
Free energy of reaction
ΔrG° (kJ/mol) | T (K) | Method | Reference | Comment |
---|---|---|---|---|
26. | 343. | PHPMS | Chowdhury, 1987 | gas phase; M |
By formula: C6F4O2- + C3H7NO = (C6F4O2- • C3H7NO)
Quantity | Value | Units | Method | Reference | Comment |
---|---|---|---|---|---|
ΔrG° | 11. ± 6.7 | kJ/mol | IMRE | Chowdhury, Grimsrud, et al., 1987 | gas phase; Free energy affinity at 70°C.; B |
Free energy of reaction
ΔrG° (kJ/mol) | T (K) | Method | Reference | Comment |
---|---|---|---|---|
11. | 343. | PHPMS | Chowdhury, 1987 | gas phase; M |
By formula: C6H4O2- + C3H7NO = (C6H4O2- • C3H7NO)
Quantity | Value | Units | Method | Reference | Comment |
---|---|---|---|---|---|
ΔrG° | 18. ± 6.7 | kJ/mol | IMRE | Chowdhury, Grimsrud, et al., 1987 | gas phase; Free energy affinity at 70°C.; B |
Free energy of reaction
ΔrG° (kJ/mol) | T (K) | Method | Reference | Comment |
---|---|---|---|---|
18. | 343. | PHPMS | Chowdhury, 1987 | gas phase; M |
By formula: C7H4N2O2- + C3H7NO = (C7H4N2O2- • C3H7NO)
Quantity | Value | Units | Method | Reference | Comment |
---|---|---|---|---|---|
ΔrG° | 20. ± 6.7 | kJ/mol | IMRE | Chowdhury, Grimsrud, et al., 1987 | gas phase; Free energy affinity at 70°C.; B |
Free energy of reaction
ΔrG° (kJ/mol) | T (K) | Method | Reference | Comment |
---|---|---|---|---|
20. | 343. | PHPMS | Chowdhury, 1987 | gas phase; M |
By formula: K+ + C3H7NO = (K+ • C3H7NO)
Quantity | Value | Units | Method | Reference | Comment |
---|---|---|---|---|---|
ΔrH° | 123. | kJ/mol | CIDT | Klassen, Anderson, et al., 1996 | RCD |
ΔrH° | 130. | kJ/mol | HPMS | Sunner, 1984 | gas phase; M |
Quantity | Value | Units | Method | Reference | Comment |
ΔrS° | 110. | J/mol*K | HPMS | Sunner, 1984 | gas phase; M |
By formula: C7H4N2O2- + C3H7NO = (C7H4N2O2- • C3H7NO)
Quantity | Value | Units | Method | Reference | Comment |
---|---|---|---|---|---|
ΔrG° | 19. ± 6.7 | kJ/mol | IMRE | Chowdhury, Grimsrud, et al., 1987 | gas phase; Free energy affinity at 70°C.; B |
Free energy of reaction
ΔrG° (kJ/mol) | T (K) | Method | Reference | Comment |
---|---|---|---|---|
19. | 343. | PHPMS | Chowdhury, 1987 | gas phase; M |
C7H4F3NO2- + = (C7H4F3NO2- •
)
By formula: C7H4F3NO2- + C3H7NO = (C7H4F3NO2- • C3H7NO)
Quantity | Value | Units | Method | Reference | Comment |
---|---|---|---|---|---|
ΔrG° | 20. ± 6.7 | kJ/mol | IMRE | Chowdhury, Grimsrud, et al., 1987 | gas phase; Free energy affinity at 70°C.; B |
Free energy of reaction
ΔrG° (kJ/mol) | T (K) | Method | Reference | Comment |
---|---|---|---|---|
20. | 343. | PHPMS | Chowdhury, 1987 | gas phase; M |
By formula: Na+ + C3H7NO = (Na+ • C3H7NO)
Quantity | Value | Units | Method | Reference | Comment |
---|---|---|---|---|---|
ΔrH° | 156. ± 4. | kJ/mol | CIDT | Armentrout and Rodgers, 2000 | See 96KLA/AND?; RCD |
Free energy of reaction
ΔrG° (kJ/mol) | T (K) | Method | Reference | Comment |
---|---|---|---|---|
126. | 298. | IMRE | McMahon and Ohanessian, 2000 | Anchor alanine=39.89; RCD |
C3H6NO- + =
By formula: C3H6NO- + H+ = C3H7NO
Quantity | Value | Units | Method | Reference | Comment |
---|---|---|---|---|---|
ΔrH° | 1670. ± 17. | kJ/mol | G+TS | DePuy, Grabowski, et al., 1985 | gas phase; B |
Quantity | Value | Units | Method | Reference | Comment |
ΔrG° | 1640. ± 17. | kJ/mol | IMRB | DePuy, Grabowski, et al., 1985 | gas phase; B |
By formula: Li+ + C3H7NO = (Li+ • C3H7NO)
Quantity | Value | Units | Method | Reference | Comment |
---|---|---|---|---|---|
ΔrH° | 210. | kJ/mol | ICR | Staley and Beauchamp, 1975 | gas phase; switching reaction(Li+)H2O, from graph; Dzidic and Kebarle, 1970 extrapolated; M |
By formula: (K+ • 2C3H7NO) + C3H7NO = (K+ • 3C3H7NO)
Quantity | Value | Units | Method | Reference | Comment |
---|---|---|---|---|---|
ΔrH° | 63. | kJ/mol | HPMS | Sunner, 1984 | gas phase; M |
Quantity | Value | Units | Method | Reference | Comment |
ΔrS° | 75. | J/mol*K | HPMS | Sunner, 1984 | gas phase; M |
By formula: (K+ • 3C3H7NO) + C3H7NO = (K+ • 4C3H7NO)
Quantity | Value | Units | Method | Reference | Comment |
---|---|---|---|---|---|
ΔrH° | 54. | kJ/mol | HPMS | Sunner, 1984 | gas phase; M |
Quantity | Value | Units | Method | Reference | Comment |
ΔrS° | 100. | J/mol*K | HPMS | Sunner, 1984 | gas phase; M |
By formula: (K+ • C3H7NO) + C3H7NO = (K+ • 2C3H7NO)
Quantity | Value | Units | Method | Reference | Comment |
---|---|---|---|---|---|
ΔrH° | 88. | kJ/mol | HPMS | Sunner, 1984 | gas phase; M |
Quantity | Value | Units | Method | Reference | Comment |
ΔrS° | 84. | J/mol*K | HPMS | Sunner, 1984 | gas phase; M |

Gas phase ion energetics data

Data evaluated as indicated in comments:
HL - Edward P. Hunter and Sharon G. Lias
L - Sharon G. Lias
Data compiled as indicated in comments:
B - John E. Bartmess
LBLHLM - Sharon G. Lias, John E. Bartmess, Joel F. Liebman, John L. Holmes, Rhoda D. Levin, and W. Gary Mallard
LLK - Sharon G. Lias, Rhoda D. Levin, and Sherif A. Kafafi
RDSH - Henry M. Rosenstock, Keith Draxl, Bruce W. Steiner, and John T. Herron
Quantity | Value | Units | Method | Reference | Comment |
---|---|---|---|---|---|
IE (evaluated) | 9.13 | eV | N/A | N/A | L |
Quantity | Value | Units | Method | Reference | Comment |
Proton affinity (review) | 887.5 | kJ/mol | N/A | Hunter and Lias, 1998 | HL |
Quantity | Value | Units | Method | Reference | Comment |
Gas basicity | 856.6 | kJ/mol | N/A | Hunter and Lias, 1998 | HL |
Electron affinity determinations
EA (eV) | Reference | Comment |
---|---|---|
0.01362 | Desfrancois, Periquet, et al., 1999 | B |
Ionization energy determinations
IE (eV) | Method | Reference | Comment |
---|---|---|---|
9.45 ± 0.05 | EI | Baldwin, Loudon, et al., 1977 | LLK |
9.14 | PE | Brundle, Turner, et al., 1969 | RDSH |
9.12 ± 0.02 | PI | Watanabe, Nakayama, et al., 1962 | RDSH |
9.14 | PE | Bieri, Asbrink, et al., 1982 | Vertical value; LBLHLM |
9.25 | PE | Henriksen, Isaksson, et al., 1981 | Vertical value; LLK |
Appearance energy determinations
Ion | AE (eV) | Other Products | Method | Reference | Comment |
---|---|---|---|---|---|
CHO+ | 14.50 | ? | EI | Loudon and Webb, 1977 | LLK |
CHO+ | 14.3 ± 0.1 | ? | EI | Gowenlock, Jones, et al., 1961 | RDSH |
C2H6N+ | 11.60 | ? | EI | Loudon and Webb, 1977 | LLK |
C2H6N+ | 11.6 ± 0.1 | ? | EI | Gowenlock, Jones, et al., 1961 | RDSH |
C3H6NO+ | 11.35 | ? | EI | Loudon and Webb, 1977 | LLK |
De-protonation reactions
C3H6NO- + =
By formula: C3H6NO- + H+ = C3H7NO
Quantity | Value | Units | Method | Reference | Comment |
---|---|---|---|---|---|
ΔrH° | 1670. ± 17. | kJ/mol | G+TS | DePuy, Grabowski, et al., 1985 | gas phase; B |
Quantity | Value | Units | Method | Reference | Comment |
ΔrG° | 1640. ± 17. | kJ/mol | IMRB | DePuy, Grabowski, et al., 1985 | gas phase; B |

Ion clustering data

Data compiled as indicated in comments:
B - John E. Bartmess
M - Michael M. Meot-Ner (Mautner) and Sharon G. Lias
RCD - Robert C. Dunbar
Clustering reactions
By formula: C6F4O2- + C3H7NO = (C6F4O2- • C3H7NO)
Quantity | Value | Units | Method | Reference | Comment |
---|---|---|---|---|---|
ΔrG° | 11. ± 6.7 | kJ/mol | IMRE | Chowdhury, Grimsrud, et al., 1987 | gas phase; Free energy affinity at 70°C.; B |
Free energy of reaction
ΔrG° (kJ/mol) | T (K) | Method | Reference | Comment |
---|---|---|---|---|
11. | 343. | PHPMS | Chowdhury, 1987 | gas phase; M |
By formula: C6H4FNO2- + C3H7NO = (C6H4FNO2- • C3H7NO)
Quantity | Value | Units | Method | Reference | Comment |
---|---|---|---|---|---|
ΔrG° | 25. ± 6.7 | kJ/mol | IMRE | Chowdhury, Grimsrud, et al., 1987 | gas phase; Free energy affinity at 70°C.; B |
Free energy of reaction
ΔrG° (kJ/mol) | T (K) | Method | Reference | Comment |
---|---|---|---|---|
25. | 343. | PHPMS | Chowdhury, 1987 | gas phase; M |
By formula: C6H4FNO2- + C3H7NO = (C6H4FNO2- • C3H7NO)
Quantity | Value | Units | Method | Reference | Comment |
---|---|---|---|---|---|
ΔrG° | 25. ± 6.7 | kJ/mol | IMRE | Chowdhury, Grimsrud, et al., 1987 | gas phase; Free energy affinity at 70°C.; B |
Free energy of reaction
ΔrG° (kJ/mol) | T (K) | Method | Reference | Comment |
---|---|---|---|---|
25. | 343. | PHPMS | Chowdhury, 1987 | gas phase; M |
By formula: C6H4FNO2- + C3H7NO = (C6H4FNO2- • C3H7NO)
Quantity | Value | Units | Method | Reference | Comment |
---|---|---|---|---|---|
ΔrG° | 23. ± 6.7 | kJ/mol | IMRE | Chowdhury, Grimsrud, et al., 1987 | gas phase; Free energy affinity at 70°C.; B |
Free energy of reaction
ΔrG° (kJ/mol) | T (K) | Method | Reference | Comment |
---|---|---|---|---|
23. | 343. | PHPMS | Chowdhury, 1987 | gas phase; M |
By formula: C6H4N2O4- + C3H7NO = (C6H4N2O4- • C3H7NO)
Quantity | Value | Units | Method | Reference | Comment |
---|---|---|---|---|---|
ΔrG° | 10. ± 6.7 | kJ/mol | IMRE | Chowdhury, Grimsrud, et al., 1987 | gas phase; Free energy affinity at 70°C.; B |
Free energy of reaction
ΔrG° (kJ/mol) | T (K) | Method | Reference | Comment |
---|---|---|---|---|
10. | 343. | PHPMS | Chowdhury, 1987 | gas phase; M |
By formula: C6H4N2O4- + C3H7NO = (C6H4N2O4- • C3H7NO)
Quantity | Value | Units | Method | Reference | Comment |
---|---|---|---|---|---|
ΔrG° | 19. ± 6.7 | kJ/mol | IMRE | Chowdhury, Grimsrud, et al., 1987 | gas phase; Free energy affinity at 70°C.; B |
Free energy of reaction
ΔrG° (kJ/mol) | T (K) | Method | Reference | Comment |
---|---|---|---|---|
19. | 343. | PHPMS | Chowdhury, 1987 | gas phase; M |
By formula: C6H4O2- + C3H7NO = (C6H4O2- • C3H7NO)
Quantity | Value | Units | Method | Reference | Comment |
---|---|---|---|---|---|
ΔrG° | 18. ± 6.7 | kJ/mol | IMRE | Chowdhury, Grimsrud, et al., 1987 | gas phase; Free energy affinity at 70°C.; B |
Free energy of reaction
ΔrG° (kJ/mol) | T (K) | Method | Reference | Comment |
---|---|---|---|---|
18. | 343. | PHPMS | Chowdhury, 1987 | gas phase; M |
By formula: C6H5NO2- + C3H7NO = (C6H5NO2- • C3H7NO)
Quantity | Value | Units | Method | Reference | Comment |
---|---|---|---|---|---|
ΔrG° | 26. ± 6.7 | kJ/mol | IMRE | Chowdhury, Grimsrud, et al., 1987 | gas phase; Free energy affinity at 70°C.; B |
Free energy of reaction
ΔrG° (kJ/mol) | T (K) | Method | Reference | Comment |
---|---|---|---|---|
26. | 343. | PHPMS | Chowdhury, 1987 | gas phase; M |
C7H4F3NO2- + = (C7H4F3NO2- •
)
By formula: C7H4F3NO2- + C3H7NO = (C7H4F3NO2- • C3H7NO)
Quantity | Value | Units | Method | Reference | Comment |
---|---|---|---|---|---|
ΔrG° | 20. ± 6.7 | kJ/mol | IMRE | Chowdhury, Grimsrud, et al., 1987 | gas phase; Free energy affinity at 70°C.; B |
Free energy of reaction
ΔrG° (kJ/mol) | T (K) | Method | Reference | Comment |
---|---|---|---|---|
20. | 343. | PHPMS | Chowdhury, 1987 | gas phase; M |
By formula: C7H4N2O2- + C3H7NO = (C7H4N2O2- • C3H7NO)
Quantity | Value | Units | Method | Reference | Comment |
---|---|---|---|---|---|
ΔrG° | 19. ± 6.7 | kJ/mol | IMRE | Chowdhury, Grimsrud, et al., 1987 | gas phase; Free energy affinity at 70°C.; B |
Free energy of reaction
ΔrG° (kJ/mol) | T (K) | Method | Reference | Comment |
---|---|---|---|---|
19. | 343. | PHPMS | Chowdhury, 1987 | gas phase; M |
By formula: C7H4N2O2- + C3H7NO = (C7H4N2O2- • C3H7NO)
Quantity | Value | Units | Method | Reference | Comment |
---|---|---|---|---|---|
ΔrG° | 20. ± 6.7 | kJ/mol | IMRE | Chowdhury, Grimsrud, et al., 1987 | gas phase; Free energy affinity at 70°C.; B |
Free energy of reaction
ΔrG° (kJ/mol) | T (K) | Method | Reference | Comment |
---|---|---|---|---|
20. | 343. | PHPMS | Chowdhury, 1987 | gas phase; M |
By formula: C7H4N2O2- + C3H7NO = (C7H4N2O2- • C3H7NO)
Quantity | Value | Units | Method | Reference | Comment |
---|---|---|---|---|---|
ΔrG° | 16. ± 6.7 | kJ/mol | IMRE | Chowdhury, Grimsrud, et al., 1987 | gas phase; Free energy affinity at 70°C.; B |
Free energy of reaction
ΔrG° (kJ/mol) | T (K) | Method | Reference | Comment |
---|---|---|---|---|
16. | 343. | PHPMS | Chowdhury, 1987 | gas phase; M |
By formula: C7H7NO2- + C3H7NO = (C7H7NO2- • C3H7NO)
Quantity | Value | Units | Method | Reference | Comment |
---|---|---|---|---|---|
ΔrG° | 26. ± 6.7 | kJ/mol | IMRE | Chowdhury, Grimsrud, et al., 1987 | gas phase; Free energy affinity at 70°C.; B |
Free energy of reaction
ΔrG° (kJ/mol) | T (K) | Method | Reference | Comment |
---|---|---|---|---|
26. | 343. | PHPMS | Chowdhury, 1987 | gas phase; M |
By formula: C7H7NO2- + C3H7NO = (C7H7NO2- • C3H7NO)
Quantity | Value | Units | Method | Reference | Comment |
---|---|---|---|---|---|
ΔrG° | 26. ± 6.7 | kJ/mol | IMRE | Chowdhury, Grimsrud, et al., 1987 | gas phase; Free energy affinity at 70°C.; B |
Free energy of reaction
ΔrG° (kJ/mol) | T (K) | Method | Reference | Comment |
---|---|---|---|---|
26. | 343. | PHPMS | Chowdhury, 1987 | gas phase; M |
By formula: C7H7NO3- + C3H7NO = (C7H7NO3- • C3H7NO)
Quantity | Value | Units | Method | Reference | Comment |
---|---|---|---|---|---|
ΔrG° | 25. ± 6.7 | kJ/mol | IMRE | Chowdhury, Grimsrud, et al., 1987 | gas phase; Free energy affinity at 70°C.; B |
Free energy of reaction
ΔrG° (kJ/mol) | T (K) | Method | Reference | Comment |
---|---|---|---|---|
25. | 343. | PHPMS | Chowdhury, 1987 | gas phase; M |
25. | 343. | PHPMS | Chowdhury, 1987 | gas phase; M |
By formula: C7H7NO3- + C3H7NO = (C7H7NO3- • C3H7NO)
Quantity | Value | Units | Method | Reference | Comment |
---|---|---|---|---|---|
ΔrG° | 26. ± 6.7 | kJ/mol | IMRE | Chowdhury, Grimsrud, et al., 1987 | gas phase; Free energy affinity at 70°C.; B |
Free energy of reaction
ΔrG° (kJ/mol) | T (K) | Method | Reference | Comment |
---|---|---|---|---|
26. | 343. | PHPMS | Chowdhury, 1987 | gas phase; M |
By formula: K+ + C3H7NO = (K+ • C3H7NO)
Quantity | Value | Units | Method | Reference | Comment |
---|---|---|---|---|---|
ΔrH° | 123. | kJ/mol | CIDT | Klassen, Anderson, et al., 1996 | RCD |
ΔrH° | 130. | kJ/mol | HPMS | Sunner, 1984 | gas phase; M |
Quantity | Value | Units | Method | Reference | Comment |
ΔrS° | 110. | J/mol*K | HPMS | Sunner, 1984 | gas phase; M |
By formula: (K+ • C3H7NO) + C3H7NO = (K+ • 2C3H7NO)
Quantity | Value | Units | Method | Reference | Comment |
---|---|---|---|---|---|
ΔrH° | 88. | kJ/mol | HPMS | Sunner, 1984 | gas phase; M |
Quantity | Value | Units | Method | Reference | Comment |
ΔrS° | 84. | J/mol*K | HPMS | Sunner, 1984 | gas phase; M |
By formula: (K+ • 2C3H7NO) + C3H7NO = (K+ • 3C3H7NO)
Quantity | Value | Units | Method | Reference | Comment |
---|---|---|---|---|---|
ΔrH° | 63. | kJ/mol | HPMS | Sunner, 1984 | gas phase; M |
Quantity | Value | Units | Method | Reference | Comment |
ΔrS° | 75. | J/mol*K | HPMS | Sunner, 1984 | gas phase; M |
By formula: (K+ • 3C3H7NO) + C3H7NO = (K+ • 4C3H7NO)
Quantity | Value | Units | Method | Reference | Comment |
---|---|---|---|---|---|
ΔrH° | 54. | kJ/mol | HPMS | Sunner, 1984 | gas phase; M |
Quantity | Value | Units | Method | Reference | Comment |
ΔrS° | 100. | J/mol*K | HPMS | Sunner, 1984 | gas phase; M |
By formula: Li+ + C3H7NO = (Li+ • C3H7NO)
Quantity | Value | Units | Method | Reference | Comment |
---|---|---|---|---|---|
ΔrH° | 210. | kJ/mol | ICR | Staley and Beauchamp, 1975 | gas phase; switching reaction(Li+)H2O, from graph; Dzidic and Kebarle, 1970 extrapolated; M |
By formula: Na+ + C3H7NO = (Na+ • C3H7NO)
Quantity | Value | Units | Method | Reference | Comment |
---|---|---|---|---|---|
ΔrH° | 156. ± 4. | kJ/mol | CIDT | Armentrout and Rodgers, 2000 | See 96KLA/AND?; RCD |
Free energy of reaction
ΔrG° (kJ/mol) | T (K) | Method | Reference | Comment |
---|---|---|---|---|
126. | 298. | IMRE | McMahon and Ohanessian, 2000 | Anchor alanine=39.89; RCD |

Kovats' RI, non-polar column, temperature ramp

Column type | Active phase | I | Reference | Comment |
---|---|---|---|---|
Capillary | CBP-1 | 752. | Shimadzu, 2003 | 25. m/0.2 mm/0.25 μm, He, 50. C @ 5. min, 4. K/min; Tend: 200. C |

Kovats' RI, polar column, temperature ramp

Column type | Active phase | I | Reference | Comment |
---|---|---|---|---|
Capillary | CBP-20 | 1333. | Shimadzu, 2003 | 25. m/0.2 mm/0.25 μm, He, 50. C @ 5. min, 4. K/min; Tend: 200. C |
Capillary | Carbowax 20M | 1304. | Nishimura, Yamaguchi, et al., 1989 | 2. K/min; Column length: 50. m; Column diameter: 0.22 mm; Tstart: 80. C; Tend: 200. C |

Van Den Dool and Kratz RI, non-polar column, temperature ramp

Column type | Active phase | I | Reference | Comment |
---|---|---|---|---|
Capillary | SPB-Sulfur | 756.3 | de Lacy Costello, Evans, et al., 2001 | 30. m/0.32 mm/4. μm, 40. C @ 12.5 min, 4. K/min; Tend: 200. C |

Van Den Dool and Kratz RI, polar column, temperature ramp

Column type | Active phase | I | Reference | Comment |
---|---|---|---|---|
Capillary | Supelcowax-10 | 1326. | Chung, Yung, et al., 2002 | 60. m/0.25 mm/0.25 μm, He, 35. C @ 5. min, 2. K/min, 195. C @ 90. min |
Capillary | Supelcowax-10 | 1326. | Chung, Yung, et al., 2001 | 60. m/0.25 mm/0.25 μm, He, 35. C @ 5. min, 2. K/min, 195. C @ 90. min |
Capillary | Supelcowax-10 | 1328. | Chung and Cadwallader, 1993 | 60. m/0.25 mm/0.25 μm, He, 40. C @ 5. min, 2. K/min, 195. C @ 40. min |
Capillary | DB-Wax | 1319. | Umano, Hagi, et al., 1992 | He, 40. C @ 10. min, 2. K/min; Column length: 30. m; Column diameter: 0.25 mm; Tend: 200. C |
Capillary | DB-Wax | 1282. | Frohlich and Schreier, 1990 | 30. m/0.32 mm/0.25 μm, He, 40. C @ 3. min, 5. K/min; Tend: 220. C |

Normal alkane RI, non-polar column, isothermal

Column type | Active phase | Temperature (C) | I | Reference | Comment |
---|---|---|---|---|---|
Capillary | Methyl Silicone | 100. | 747. | Lebrón-Aguilar, Quintanilla-López, et al., 2007 | |
Capillary | Methyl Silicone | 120. | 750. | Lebrón-Aguilar, Quintanilla-López, et al., 2007 | |
Capillary | Methyl Silicone | 140. | 753. | Lebrón-Aguilar, Quintanilla-López, et al., 2007 | |
Capillary | Methyl Silicone | 80. | 745. | Lebrón-Aguilar, Quintanilla-López, et al., 2007 | |
Capillary | DB-1 | 60. | 742. | Shimadzu, 2003, 2 | 60. m/0.32 mm/1. μm, He |
Packed | DC-400 | 150. | 790. | Anderson, 1968 | Helium, Gas-Pak (60-80 mesh); Column length: 3.0 m |

Normal alkane RI, non-polar column, temperature ramp

Column type | Active phase | I | Reference | Comment |
---|---|---|---|---|
Capillary | HP-5 MS | 772. | Radulovic, Blagojevic, et al., 2010 | 30. m/0.25 mm/0.25 μm, Helium, 5. K/min, 290. C @ 10. min; Tstart: 70. C |
Capillary | VF-5 | 783. | Li and Zhao, 2009 | 30. m/0.25 mm/0.25 μm, Helium, 60. C @ 2. min, 10. K/min, 300. C @ 10. min |

Normal alkane RI, non-polar column, custom temperature program

Column type | Active phase | I | Reference | Comment |
---|---|---|---|---|
Capillary | SPB-1 | 746. | Flanagan, Streete, et al., 1997 | 60. m/0.53 mm/5. μm, He; Program: 40C(6min) => 5C/min => 80C => 10C/min => 200C |
Capillary | Methyl Silicone | 751. | Zenkevich, Korolenko, et al., 1995 | Program: not specified |
Capillary | SPB-1 | 746. | Strete, Ruprah, et al., 1992 | 60. m/0.53 mm/5.0 μm, Helium; Program: 40 0C (6 min) 5 0C/min -> 80 0C 10 0C/min -> 200 0C |
Capillary | DB-1 | 735. | Kawai, Ishida, et al., 1991 | 60. m/0.25 mm/0.25 μm; Program: not specified |
Capillary | DB-1 | 738. | Kawai, Ishida, et al., 1991 | 60. m/0.25 mm/0.25 μm; Program: not specified |
Capillary | CP Sil 8 CB | 782. | Weller and Wolf, 1989 | 40. m/0.25 mm/0.25 μm, He; Program: 30 0C (1 min) 15 0C/min -> 45 0C 3 0C/min -> 120 0C |

Normal alkane RI, polar column, isothermal

Column type | Active phase | Temperature (C) | I | Reference | Comment |
---|---|---|---|---|---|
Capillary | DB-Wax | 60. | 1344. | Shimadzu, 2003, 2 | 50. m/0.32 mm/1. μm, He |

Normal alkane RI, polar column, temperature ramp

Column type | Active phase | I | Reference | Comment |
---|---|---|---|---|
Capillary | DB-Wax | 1361. | Shimadzu, 2012 | 30. m/0.32 mm/0.50 μm, Helium, 4. K/min; Tstart: 40. C; Tend: 260. C |
Capillary | DB-Wax | 1361. | Shimadzu Corporation, 2003 | 30. m/0.32 mm/0.5 μm, He, 4. K/min; Tstart: 40. C; Tend: 260. C |
Capillary | PEG-20M | 1295. | Kubota, Matsujage, et al., 1996 | 50. m/0.25 mm/0.25 μm, Nitrogen, 2. K/min; Tstart: 60. C; Tend: 180. C |

Normal alkane RI, polar column, custom temperature program

Column type | Active phase | I | Reference | Comment |
---|---|---|---|---|
Capillary | Polyethylene Glycol | 1325. | Zenkevich, Korolenko, et al., 1995 | Program: not specified |
Capillary | DB-Wax | 1312. | Peng, Yang, et al., 1991 | Program: not specified |
Capillary | DB-Wax | 1327. | Peng, Yang, et al., 1991 | Program: not specified |
Capillary | CP-Wax 52CB | 1290. | Vernin, 1991 | Column length: 50. m; Column diameter: 0.32 mm; Program: not specified |
Capillary | Superox 0.6; Carbowax 20M | 1276. | Waggott and Davies, 1984 | Hydrogen; Column length: 50. m; Column diameter: 0.32 mm; Program: not specified |
Capillary | Carbowax 400, Carbowax 20M, Carbowax 1540, Carbowax 4000, Superox 06, PEG 20M, etc. | 1276. | Waggott and Davies, 1984 | Hydrogen; Column length: 50. m; Column diameter: 0.32 mm; Program: not specified |

References

Vasil'eva, Zhil'tsova, et al., 1972
Vasil'eva, T.F.; Zhil'tsova, E.N.; Vvedenskii, A.A.,
Enthalpies of combustion of NN-dimethylformamide and NN-dimethylacetamide,
Russ. J. Phys. Chem. (Engl. Transl.), 1972, 46, 315. [all data]
Medard and Thomas, 1957
Medard, L.; Thomas, M.,
Chaleur de combustion de onze substances explosives ou apparentees a des explosifs,
Mem. Poudres, 1957, 39, 195-208. [all data]
Grolier, Roux-Desgranges, et al., 1993
Grolier, J.-P.E.; Roux-Desgranges, G.; Berkane, M.; Jimenez, E.; Wilhelm, E.,
Heat capacities and densities of mixtures of very polar substances 2. Mixtures containing N,N-dimethylformamide,
J. Chem. Thermodynam., 1993, 25(1), 41-50. [all data]
Kolker, Kulikov, et al., 1992
Kolker, A.M.; Kulikov, M.V.; Krestov, Al.G.,
Volumes and heat capacities of binary non-aqueous mixtures. Part 2. The systems acetonitrile-N,N-dimethylformamide and acetonitrile-hexamethylphosphoric triamide,
Thermochim. Acta, 1992, 211, 73-84. [all data]
Kulikov, Krestov, et al., 1989
Kulikov, M.V.; Krestov, A.G.; Safonova, L.P.; Kolker, A.M.,
Excess thermodynamic functions in the systems water + N-methylformamide, and water + N,N-dimethylformamide, Sbornik Nauch Trud., Termodin. rast. neelect., Ivanovo,
Inst. nevod. rast., 1989, Akad. [all data]
Petrov, Peshekhodov, et al., 1989
Petrov, A.N.; Peshekhodov, P.B.; Al'per, G.A.,
Heat capacity of non-aqueous solutions of non-electrolyts with N,N-dimethylformamide as a base, Sbornik Nauch. Trud., Termodin. Rast. neelect., Ivanovo,
Inst. nevod. rast., 1989, Akad. [all data]
Zegers and Somsen, 1984
Zegers, H.C.; Somsen, G.,
Partial molar volumes and heat capacities in (dimethylformamide + an n-alkanol),
J. Chem. Thermodynam., 1984, 16, 225-235. [all data]
Vorob'ev and Yakovlev, 1982
Vorob'ev, A.F.; Yakovlev, P.N.,
The specific heats of dimethylformamide-water and hexamethylphosphoramide-water mixtures,
Zhur. Fiz. Khim., 1982, 56, 1933-1936. [all data]
de Visser and Somsen, 1979
de Visser, C.; Somsen, G.,
Thermochemical behavior of mixtures of N,N-dimethylformamide with dimethylsulfoxide, acetonitrile, and N-methylformamide: volumes and heat capacities,
J. Solution Chem., 1979, 8, 593-600. [all data]
Marchidan and Ciopec, 1978
Marchidan, D.I.; Ciopec, M.,
Relative enthalpies and related thermodynamic functions of some organic compounds by drop calorimetry,
J. Therm. Anal., 1978, 14, 131-150. [all data]
De Visser, Perron, et al., 1977
De Visser, C.; Perron, G.; Desnoyers, J.E.,
Volumes and heat capacities of ternary aqueous systems at 25°C. Mixtures of urea, tert-butyl alcohol, N,N-dimethylformamide, and water,
J. Amer. Chem. Soc., 1977, 99, 5894-5900. [all data]
De Visser, Perron, et al., 1977, 2
De Visser, C.; Perron, G.; Desnoyers, J.E.; Heuvelsland, W.J.M.; Somsen, G.,
Volumes and heat capacities of mixtures of N,N-dimethylformamide and water at 298.15 K,
J. Chem. Eng. Data, 1977, 22, 74-79. [all data]
Bonner and Cerutti, 1976
Bonner, O.D.; Cerutti, P.J.,
The partial molar heat capacities of some solutes in water and deuterium oxide,
J. Chem. Thermodynam., 1976, 8, 105-111. [all data]
de Visser and Somsen, 1974
de Visser, C.; Somsen, G.,
Molar heat capacities of binary mixtures of water and some amides at 298.15 K,
Z. Physik. Chem. [N.F.], 1974, 92, 159-162. [all data]
Geller, 1961
Geller, B.E.,
Some physicochemical properties of dimethylformamide,
Zhur. Fiz. Khim., 1961, 35, 2210-2216. [all data]
Dreisbach, 1955
Dreisbach, R.R.,
Physical Properties of Chemical Compounds, Advances in Chemistry Series No. 15, Am. Chem. Soc.: Washington, D. C., 1955. [all data]
Teja and Anselme, 1990
Teja, A.S.; Anselme, M.J.,
The critical properties of thermally stable and unstable fluids. I. 1985 results,
AIChE Symp. Ser., 1990, 86, 279, 115-21. [all data]
Panneerselvam, Antony, et al., 2009
Panneerselvam, K.; Antony, M.P.; Srinivasan, T.G.; Vasudeva Rao, P.R.,
Enthalpies of vaporization of N,N-dialkyl monamides at 298.15K,
Thermochimica Acta, 2009, 495, 1-2, 1-4, https://doi.org/10.1016/j.tca.2009.05.007
. [all data]
Barone, Castronuovo, et al., 1985
Barone, G.; Castronuovo, G.; Della Gatta, G.; Elia, V.; Iannone, A.,
Enthalpies of vaporization of seven alkylamides,
Fluid Phase Equilibria, 1985, 21, 1-2, 157-164, https://doi.org/10.1016/0378-3812(85)90066-4
. [all data]
Majer and Svoboda, 1985
Majer, V.; Svoboda, V.,
Enthalpies of Vaporization of Organic Compounds: A Critical Review and Data Compilation, Blackwell Scientific Publications, Oxford, 1985, 300. [all data]
Geller, 1961, 2
Geller, B.E.,
Properties of the dimethylformamide water system. I. Thermochemical properties,
Russ. J. Phys. Chem. (Engl. Transl.), 1961, 35, 542-564. [all data]
Muñoz, Montón, et al., 2005
Muñoz, R.; Montón, J.B.; Burguet, M.C.; de la Torre, J.,
Phase equilibria in the systems isobutyl alcohol+N,N-dimethylformamide, isobutyl acetate+N,N-dimethylformamide and isobutyl alcohol+isobutyl acetate+N,N-dimethylformamide at 101.3kPa,
Fluid Phase Equilibria, 2005, 232, 1-2, 62-69, https://doi.org/10.1016/j.fluid.2005.03.014
. [all data]
Blanco, Beltrán, et al., 1997
Blanco, Beatriz; Beltrán, Sagrario; Cabezas, José Luis; Coca, José,
Phase Equilibria of Binary Systems Formed by Hydrocarbons from Petroleum Fractions and the Solvents N -Methylpyrrolidone and N , N -Dimethylformamide. 1. Isobaric Vapor-Liquid Equilibria,
J. Chem. Eng. Data, 1997, 42, 5, 938-942, https://doi.org/10.1021/je970059u
. [all data]
Marzal, Gabaldon, et al., 1995
Marzal, Paula; Gabaldon, Carmen; Seco, Aurora; Monton, Juan B.,
Isobaric Vapor-Liquid Equilibria of 1-Butanol + N,N-Dimethylformamide and 1-Pentanol + N,N-Dimethylformamide Systems at 50.00 and 100.00 kPa,
J. Chem. Eng. Data, 1995, 40, 3, 589-592, https://doi.org/10.1021/je00019a010
. [all data]
Stephenson and Malanowski, 1987
Stephenson, Richard M.; Malanowski, Stanislaw,
Handbook of the Thermodynamics of Organic Compounds, 1987, https://doi.org/10.1007/978-94-009-3173-2
. [all data]
Bludilina, Baev, et al., 1979
Bludilina, V.I.; Baev, A.K.; Matveev, V.K.; Gaidym, I.L.; Shcherbina, E.I.,
Zh. Fiz. Khim., 1979, 53, 1052. [all data]
Myasinkova, Schmelev, et al., 1974
Myasinkova, L.F.; Schmelev, V.A.; Vaisman, I.L.; Bushinskii, V.I.; Novokhatka, D.A.,
Zh. Prikl. Khim. (Leningrad), 1974, 47, 2604. [all data]
Boublik, Fried, et al., 1984
Boublik, T.; Fried, V.; Hala, E.,
The Vapour Pressures of Pure Substances: Selected Values of the Temperature Dependence of the Vapour Pressures of Some Pure Substances in the Normal and Low Pressure Region, 2nd ed., Elsevier, New York, 1984, 972. [all data]
Gopal and Rizvi, 1968
Gopal, R.; Rizvi, S.A.,
J. Indian Chem. Soc., 1968, 45, 1, 13. [all data]
Gopal and Rizvi, 1968, 2
Gopal, R.; Rizvi, S.A.,
Vapour Pressures of Some Mono- and Di-Alkyl Substituted Aliphatic Amides at Different Temperatures,
J. Indian Chem. Soc., 1968, 45, 1, 13-16. [all data]
Karyakin, Rabinovich, et al., 1978
Karyakin, N.V.; Rabinovich, I.B.; Pal'tseva, N.G.,
Thermodynamics of the reactions of aromatic diamines with dianhydrides of tetracarboxylic acids, Vysokomol. Soedin,
Ser., 1978, A 20(9), 2025-2029. [all data]
Smirnova, Tsvetkova, et al., 2007
Smirnova, N.N.; Tsvetkova, L.Ya.; Bykova, T.A.; Marcus, Yizhak,
Thermodynamic properties of N,N-dimethylformamide and N,N-dimethylacetamide,
The Journal of Chemical Thermodynamics, 2007, 39, 11, 1508-1513, https://doi.org/10.1016/j.jct.2007.02.009
. [all data]
Domalski and Hearing, 1996
Domalski, Eugene S.; Hearing, Elizabeth D.,
Heat Capacities and Entropies of Organic Compounds in the Condensed Phase. Volume III,
J. Phys. Chem. Ref. Data, 1996, 25, 1, 1, https://doi.org/10.1063/1.555985
. [all data]
Chowdhury, Grimsrud, et al., 1987
Chowdhury, S.; Grimsrud, E.P.; Kebarle, P.,
Bonding of Charged Delocalized Anions to Protic and Dipolar Aprotic Solvent Molecules,
J. Phys. Chem., 1987, 91, 10, 2551, https://doi.org/10.1021/j100294a021
. [all data]
Chowdhury, 1987
Chowdhury, S. Grimsrud,
Bonding of Charge Delocalized Anions to Protic and Dipolar Aprotic Solvents,
J. Phys. Chem., 1987, 91, 10, 2551, https://doi.org/10.1021/j100294a021
. [all data]
Klassen, Anderson, et al., 1996
Klassen, J.S.; Anderson, S.G.; Blades, A.T.; Kebarle, P.,
Reaction Enthalpies for M+L = M+ + L, Where M+ = Na+ and K+ and L = Acetamide, N-Methylacetamide, N,N-Dimethylacetamide, Glycine, and Glycylglycine, from Determinations of the Collision-Induced Dissociation Thresholds,
J. Phys. Chem., 1996, 100, 33, 14218, https://doi.org/10.1021/jp9608382
. [all data]
Sunner, 1984
Sunner, J. Kebarle,
Ion - Solvent Molecule Interactions in the Gas Phase. The Potassium Ion and Me2SO, DMA, DMF, and Acetone,
J. Am. Chem. Soc., 1984, 106, 21, 6135, https://doi.org/10.1021/ja00333a002
. [all data]
Armentrout and Rodgers, 2000
Armentrout, P.B.; Rodgers, M.T.,
An Absolute Sodium Cation Affinity Scale: Threshold Collision-Induced Dissociation Experiments and ab Initio Theory,
J. Phys. Chem A, 2000, 104, 11, 2238, https://doi.org/10.1021/jp991716n
. [all data]
McMahon and Ohanessian, 2000
McMahon, T.B.; Ohanessian, G.,
An Experimental and Ab Initio Study of the Nature of the Binding in Gas-Phase Complexes of Sodium Ions,
Chem. Eur. J., 2000, 6, 16, 2931, https://doi.org/10.1002/1521-3765(20000818)6:16<2931::AID-CHEM2931>3.0.CO;2-7
. [all data]
DePuy, Grabowski, et al., 1985
DePuy, C.H.; Grabowski, J.J.; Bierbaum, V.M.; Ingemann, S.; Nibbering, N.M.M.,
Gas-phase reactions of anions with methyl formate and N,N-dimethylformamide,
J. Am. Chem. Soc., 1985, 107, 1093. [all data]
Staley and Beauchamp, 1975
Staley, R.H.; Beauchamp, J.L.,
Intrinsic Acid - Base Properties of Molecules. Binding Energies of Li+ to pi - and n - Donor Bases,
J. Am. Chem. Soc., 1975, 97, 20, 5920, https://doi.org/10.1021/ja00853a050
. [all data]
Dzidic and Kebarle, 1970
Dzidic, I.; Kebarle, P.,
Hydration of the Alkali Ions in the Gas Phase. Enthalpies and Entropies of Reactions M+(H2O)n-1 + H2O = M+(H2O)n,
J. Phys. Chem., 1970, 74, 7, 1466, https://doi.org/10.1021/j100702a013
. [all data]
Hunter and Lias, 1998
Hunter, E.P.; Lias, S.G.,
Evaluated Gas Phase Basicities and Proton Affinities of Molecules: An Update,
J. Phys. Chem. Ref. Data, 1998, 27, 3, 413-656, https://doi.org/10.1063/1.556018
. [all data]
Desfrancois, Periquet, et al., 1999
Desfrancois, C.; Periquet, V.; Carles, S.; Schermann, J.P.; Smith, D.M.A.; Adamowicz, L.,
Experimental and ab initio theoretical studies of electron binding to formamide, N-methylformamide, and N,N-dimethylformamide.,
J. Chem. Phys., 1999, 110, 9, 4309-4314, https://doi.org/10.1063/1.478353
. [all data]
Baldwin, Loudon, et al., 1977
Baldwin, M.A.; Loudon, A.G.; Webb, K.S.; Cardnell, P.C.,
Charge location and fragmentation under electron impact. V-The ionization potentials of (methylated) phosphoramides, guanidines, formamides, acetamides, ureas and thioureas,
Org. Mass Spectrom., 1977, 12, 279. [all data]
Brundle, Turner, et al., 1969
Brundle, C.R.; Turner, D.W.; Robin, M.B.; Basch, H.,
Photoelectron spectroscopy of simple amides and carboxylic acids,
Chem. Phys. Lett., 1969, 3, 292. [all data]
Watanabe, Nakayama, et al., 1962
Watanabe, K.; Nakayama, T.; Mottl, J.,
Ionization potentials of some molecules,
J. Quant. Spectry. Radiative Transfer, 1962, 2, 369. [all data]
Bieri, Asbrink, et al., 1982
Bieri, G.; Asbrink, L.; Von Niessen, W.,
30.4-nm He(II) photoelectron spectra of organic molecules,
J. Electron Spectrosc. Relat. Phenom., 1982, 27, 129. [all data]
Henriksen, Isaksson, et al., 1981
Henriksen, L.; Isaksson, R.; Liljefors, T.; Sandstrom, J.,
Ultraviolet absorption and photoelectron spectra of some cyclic and open-chain mono- and dithiooxamides,
Acta Chem. Scand., Ser. B, 1981, 35, 489. [all data]
Loudon and Webb, 1977
Loudon, A.G.; Webb, K.S.,
The nature of the [C2H6N]+ and [CH4N]+ ions formed by electron impact on methylated formamides, acetamides, ureas, thioureas and hexamethylphosphoramide,
Org. Mass Spectrom., 1977, 12, 283. [all data]
Gowenlock, Jones, et al., 1961
Gowenlock, B.G.; Jones, P.P.; Majer, J.R.,
Bond dissociation energies in some molecules containing alkyl substituted CH3, NH2, and OH,
J. Chem. Soc. Faraday Trans., 1961, 57, 23. [all data]
Hunt and Simpson, 1953
Hunt, H.D.; Simpson, W.T.,
Spectra of simple amides in the vacuum ultraviolet,
J. Am. Chem. Soc., 1953, 75, 4540-4543. [all data]
Shimadzu, 2003
Shimadzu,
Gas chromatography analysis of organic solvents using capillary columns (No. 2), 2003, retrieved from http://www.shimadzu.com/apps/form.cfm. [all data]
Nishimura, Yamaguchi, et al., 1989
Nishimura, O.; Yamaguchi, K.; Mihara, S.; Shibamoto, T.,
Volatile Constituents of Guava Fruits (Psidium guajava L.) and Canned Puree,
J. Agric. Food Chem., 1989, 37, 1, 139-142, https://doi.org/10.1021/jf00085a033
. [all data]
de Lacy Costello, Evans, et al., 2001
de Lacy Costello, B.P.J.; Evans, P.; Ewen, R.J.; Gunson, H.E.; Jones, P.R.H.; Ratcliffe, N.M.; Spencer-Phillips, P.T.N.,
Gas chromatography-mass spectrometry analyses of volatile organic compounds from potato tubers inoculated with Phytophthora infestans or Fusarium coeruleum,
Plant Pathol., 2001, 50, 4, 489-496, https://doi.org/10.1046/j.1365-3059.2001.00594.x
. [all data]
Chung, Yung, et al., 2002
Chung, H.-Y.; Yung, I.K.S.; Ma, W.C.J.; Kim, J.-S.,
Analysis of volatile components in frozen and dried scallops (Patinopecten yessoensis) by gas chromatography/mass spectrometry,
Food Res. Int., 2002, 35, 1, 43-53, https://doi.org/10.1016/S0963-9969(01)00107-7
. [all data]
Chung, Yung, et al., 2001
Chung, H.Y.; Yung, I.K.S.; Kim, J.-S.,
Comparison of volatile components in dried scallops (Chlamys farreri and Patinopecten yessoensis) prepared by boiling and steaming methods,
J. Agric. Food Chem., 2001, 49, 1, 192-202, https://doi.org/10.1021/jf000692a
. [all data]
Chung and Cadwallader, 1993
Chung, H.Y.; Cadwallader, K.R.,
Volatile components in blue crab (Callinectes sapidus) meat and processing by-product,
J. Food Sci., 1993, 58, 6, 1203-1207, https://doi.org/10.1111/j.1365-2621.1993.tb06148.x
. [all data]
Umano, Hagi, et al., 1992
Umano, K.; Hagi, Y.; Nakahara, K.; Shoji, A.; Shibamoto, T.,
Volatile constituents of green and ripened pineapple (Aanas comosus [L.] Merr.),
J. Agric. Food Chem., 1992, 40, 4, 599-603, https://doi.org/10.1021/jf00016a014
. [all data]
Frohlich and Schreier, 1990
Frohlich, O.; Schreier, P.,
Volatile Constituents of Loquat (Eriobotrya japonica Lindl.) Fruit,
J. Food Sci., 1990, 55, 1, 176-180, https://doi.org/10.1111/j.1365-2621.1990.tb06046.x
. [all data]
Lebrón-Aguilar, Quintanilla-López, et al., 2007
Lebrón-Aguilar, R.; Quintanilla-López, J.E.; Tello, A.M.; Santiuste, J.M.,
Isothermal retention indices on poly (3,3,3-trifluoropropylmethylsiloxane) stationary phases,
J. Chromatogr. A, 2007, 1160, 1-2, 276-288, https://doi.org/10.1016/j.chroma.2007.05.025
. [all data]
Shimadzu, 2003, 2
Shimadzu,
Gas chromatography analysis of organic solvents using capillary columns (No. 3), 2003, retrieved from http://www.shimadzu.com/apps/form.cfm. [all data]
Anderson, 1968
Anderson, D.G.,
USe of Kovats retention indices and response factors for the qualitative and quantitative analysis of coating solvents,
J. Paint Technol., 1968, 40, 527, 549-557. [all data]
Radulovic, Blagojevic, et al., 2010
Radulovic, N.; Blagojevic, P.; Palic, R.,
Comparative study of the leaf volatiles of Arctostaphylos uva-ursi (L.) Spreng. and Vaccinium vitis-idaea L. (Ericaceae),
Molecules, 2010, 15, 9, 6168-6185, https://doi.org/10.3390/molecules15096168
. [all data]
Li and Zhao, 2009
Li, L.; Zhao, J.,
Determination of the volatile composition of Rhodobryum giganteum (Schwaegr.) Par. (Bryaceae) using solid-phase microextraction and gas chromatography / mass spectrometry (GC/MS),
Molecules, 2009, 14, 6, 2195-2201, https://doi.org/10.3390/molecules14062195
. [all data]
Flanagan, Streete, et al., 1997
Flanagan, R.J.; Streete, P.J.; Ramsey, J.D.,
Volatile Substance Abuse, UNODC Technical Series, No 5, United Nations, Office on Drugs and Crime, Vienna International Centre, PO Box 500, A-1400 Vienna, Austria, 1997, 56, retrieved from http://www.odccp.org/pdf/technicalseries1997-01-011.pdf. [all data]
Zenkevich, Korolenko, et al., 1995
Zenkevich, I.G.; Korolenko, L.I.; Khralenkova, N.B.,
Desorption with solvent vapor as a method of sample preparation in the sorption preconcentration of organic-compounds from the air of a working area and from industrial-waste gases,
J. Appl. Chem. USSR (Engl. Transl.), 1995, 50, 10, 937-944. [all data]
Strete, Ruprah, et al., 1992
Strete, P.J.; Ruprah, M.; Ramsey, J.D.; Flanagan, R.J.,
Detection and identification of volatile substances by headspace capillary gas chromatography to aid the diagnosis of acute poisoning,
Analyst, 1992, 117, 7, 1111-1127, https://doi.org/10.1039/an9921701111
. [all data]
Kawai, Ishida, et al., 1991
Kawai, T.; Ishida, Y.; Kakiuchi, H.; Ikeda, N.; Higashida, T.; Nakamura, S.,
Flavor components of dried squid,
J. Agric. Food Chem., 1991, 39, 4, 770-777, https://doi.org/10.1021/jf00004a031
. [all data]
Weller and Wolf, 1989
Weller, J.-P.; Wolf, M.,
Massenspektroskopie und Headspace-GC,
Beitr. Gerichtl. Med., 1989, 47, 525-532. [all data]
Shimadzu, 2012
Shimadzu, Pharmaceutical Related,
Analysis of pharmaceutical residual solvent (observation of separation) (1) - GC, 2012, retrieved from www.shimadzu.ru/applications/Applicationspdf/GC/Pharma/Pharmaceutical residual solvents GC.pdf. [all data]
Shimadzu Corporation, 2003
Shimadzu Corporation,
Analysis of pharmaceutical residual solvent (observation of separation), 2003, retrieved from http://www.shimadzu.com.br/analitica/aplicacoes/book/pharm69.pdf. [all data]
Kubota, Matsujage, et al., 1996
Kubota, K.; Matsujage, Y.; Sekiwa, Y.; Kobayashi, A.,
Identification of the characteristic volatile flavor compounds formed by cooking squid (Todarodes pacificus Steenstrup),
Food Sci. Technol., 1996, 2, 3, 163-166. [all data]
Peng, Yang, et al., 1991
Peng, C.T.; Yang, Z.C.; Ding, S.F.,
Prediction of rentention idexes. II. Structure-retention index relationship on polar columns,
J. Chromatogr., 1991, 586, 1, 85-112, https://doi.org/10.1016/0021-9673(91)80028-F
. [all data]
Vernin, 1991
Vernin, G.,
Volatile constituents of the essential oil of Santolina chamaecyparissus L.,
J. Essent. Oil Res., 1991, 3, 1, 49-53, https://doi.org/10.1080/10412905.1991.9697907
. [all data]
Waggott and Davies, 1984
Waggott, A.; Davies, I.W.,
Identification of organic pollutants using linear temperature programmed retention indices (LTPRIs) - Part II, 1984, retrieved from http://dwi.defra.gov.uk/research/completed-research/reports/dwi0383.pdf. [all data]