Nitric acid, propyl ester
- Formula: C3H7NO3
- Molecular weight: 105.0926
- IUPAC Standard InChIKey: JNTOKFNBDFMTIV-UHFFFAOYSA-N
- CAS Registry Number: 627-13-4
- Chemical structure:
View 3d structure (requires JavaScript / HTML 5) - Other names: n-Propyl nitrate; Propyl nitrate; n-C3H7ONO2; Monopropyl nitrate; Nitrate de propyle normal; Propylester kyseliny dusicne; UN 1865

Phase change data

Data compiled as indicated in comments:
TRC - Thermodynamics Research Center, NIST Boulder Laboratories, Chris Muzny director
ALS - Hussein Y. Afeefy, Joel F. Liebman, and Stephen E. Stein
AC - William E. Acree, Jr., James S. Chickos
Quantity | Value | Units | Method | Reference | Comment |
---|---|---|---|---|---|
Tboil | 383.7 | K | N/A | Lecat, 1947 | Uncertainty assigned by TRC = 0.5 K; TRC |
Tboil | 383.6 | K | N/A | Perkin, 1889 | Uncertainty assigned by TRC = 1.5 K; TRC |
Quantity | Value | Units | Method | Reference | Comment |
ΔvapH° | 40.58 | kJ/mol | V | Gray and Pratt, 1957 | ALS |
Enthalpy of vaporization
ΔvapH (kJ/mol) | Temperature (K) | Method | Reference | Comment |
---|---|---|---|---|
41.7 | 288. | A | Stephenson and Malanowski, 1987 | Based on data from 273. to 343. K. See also Gray and Pratt, 1957, 2 and Dykyj, 1970.; AC |
Antoine Equation Parameters
log10(P) = A − (B / (T + C))
P = vapor pressure (bar)
T = temperature (K)
View plot Requires a JavaScript / HTML 5 canvas capable browser.
Temperature (K) | A | B | C | Reference | Comment |
---|---|---|---|---|---|
273. to 343. | 4.86209 | 1721.723 | -27.66 | Gray and Pratt, 1957, 3 | Coefficents calculated by NIST from author's data. |

Reaction thermochemistry data

Data compiled by: Hussein Y. Afeefy, Joel F. Liebman, and Stephen E. Stein
Individual Reactions
By formula: C3H8O + HNO3 = C3H7NO3 + H2O
Quantity | Value | Units | Method | Reference | Comment |
---|---|---|---|---|---|
ΔrH° | -21.8 | kJ/mol | Eqk | Rubtsov, 1986 | liquid phase |

Gas phase ion energetics data

Data compiled as indicated in comments:
RDSH - Henry M. Rosenstock, Keith Draxl, Bruce W. Steiner, and John T. Herron
Ionization energy determinations
IE (eV) | Method | Reference | Comment |
---|---|---|---|
11.07 ± 0.02 | PI | Watanabe, Nakayama, et al., 1962 | RDSH |
Appearance energy determinations
Ion | AE (eV) | Other Products | Method | Reference | Comment |
---|---|---|---|---|---|
C3H7+ | 11.8 | ? | EI | Fraser and Paul, 1968 | RDSH |

Normal alkane RI, non-polar column, temperature ramp

Column type | Active phase | I | Reference | Comment |
---|---|---|---|---|
Capillary | DB-1 | 700. | Schneider and Ballschniter, 1996 | 40. C @ 3. min, 3. K/min; Tend: 250. C |

Condensed phase thermochemistry data

Data compiled by: Hussein Y. Afeefy, Joel F. Liebman, and Stephen E. Stein
Quantity | Value | Units | Method | Reference | Comment |
---|---|---|---|---|---|
ΔfH°liquid | -215. ± 1. | kJ/mol | Ccb | Fairbrother, Skinner, et al., 1957 | |
Quantity | Value | Units | Method | Reference | Comment |
ΔcH°liquid | -1966. ± 1. | kJ/mol | Ccb | Fairbrother, Skinner, et al., 1957 |

References

Lecat, 1947
Lecat, M.,
Orthobaric Azeotropes of Sulfides,
Bull. Cl. Sci., Acad. R. Belg., 1947, 33, 160-82. [all data]
Perkin, 1889
Perkin, W.H.,
The Magneto Rotatory Power of Nitrogne Compounds. also of Hydrochloric Hydrobromic and Hydroioidic Acids and of some of the Salts of Ammonia and the Compound Ammonias,
J. Chem. Soc., 1889, 55, 680. [all data]
Gray and Pratt, 1957
Gray, P.; Pratt, M.W.T.,
The latent heats of vaporization of the alkyl nitrates,
J. Chem. Soc., 1957, 2163-21. [all data]
Stephenson and Malanowski, 1987
Stephenson, Richard M.; Malanowski, Stanislaw,
Handbook of the Thermodynamics of Organic Compounds, 1987, https://doi.org/10.1007/978-94-009-3173-2
. [all data]
Gray and Pratt, 1957, 2
Gray, Peter; Pratt, M.W.T.,
414. The latent heats of vaporization of the alkyl nitrates,
J. Chem. Soc., 1957, 2163, https://doi.org/10.1039/jr9570002163
. [all data]
Dykyj, 1970
Dykyj, J.,
Petrochemica, 1970, 10, 2, 51. [all data]
Gray and Pratt, 1957, 3
Gray, P.; Pratt, M.W.T.,
The Latent Heats of Vaporization of the Alkyl Nitrates,
J. Chem. Soc., 1957, 2163-2168, https://doi.org/10.1039/jr9570002163
. [all data]
Rubtsov, 1986
Rubtsov, Yu.I.,
Thermodynamic calculation of equilibrium in nitration of alcohols,
Bull. Acad. Sci. USSR, Div. Chem. Sci., 1986, 19-22. [all data]
Watanabe, Nakayama, et al., 1962
Watanabe, K.; Nakayama, T.; Mottl, J.,
Ionization potentials of some molecules,
J. Quant. Spectry. Radiative Transfer, 1962, 2, 369. [all data]
Fraser and Paul, 1968
Fraser, R.T.M.; Paul, N.C.,
The mass spectrometry of nitrate esters and related compounds. Part I,
J. Chem. Soc. B, 1968, 659. [all data]
Schneider and Ballschniter, 1996
Schneider, M.; Ballschniter, K.,
Separation of Diastereomeric and Enentiomeric Alkyl Nitrates - Systematic Approach to Chiral Discrimination on Cyclodextrin LIPODEX-D,
Chem. Eur. J., 1996, 2, 5, 539-544, https://doi.org/10.1002/chem.19960020513
. [all data]