Glycine, methyl ester
- Formula: C3H7NO2
- Molecular weight: 89.0932
- IUPAC Standard InChIKey: KQSSATDQUYCRGS-UHFFFAOYSA-N
- CAS Registry Number: 616-34-2
- Chemical structure:
View 3d structure (requires JavaScript / HTML 5) - Other names: NH2CH2COOCH3; methyl glycinate

Gas phase ion energetics data

Data compiled as indicated in comments:
LBLHLM - Sharon G. Lias, John E. Bartmess, Joel F. Liebman, John L. Holmes, Rhoda D. Levin, and W. Gary Mallard
Ionization energy determinations
IE (eV) | Method | Reference | Comment |
---|---|---|---|
9.1 | PE | Cannington and Ham, 1983 | LBLHLM |
9.8 | PE | Cannington and Ham, 1983 | Vertical value; LBLHLM |

Van Den Dool and Kratz RI, non-polar column, custom temperature program

Column type | Active phase | I | Reference | Comment |
---|---|---|---|---|
Capillary | VF-5MS | 749. | Tret'yakov, 2007 | 30. m/0.25 mm/0.25 μm, He; Program: Multi-step temperature program; T(initial)=60C; T(final)=270C |

References

Cannington and Ham, 1983
Cannington, P.H.; Ham, N.S.,
He(I) and He(II) photoelectron spectra of glycine and related molecules,
J. Electron Spectrosc. Relat. Phenom., 1983, 32, 139. [all data]
Tret'yakov, 2007
Tret'yakov, K.V.,
Retention Data. NIST Mass Spectrometry Data Center., NIST Mass Spectrometry Data Center, 2007. [all data]