3-Nitrobenzyl radical
- Formula: C7H6NO2
- Molecular weight: 136.1280
- IUPAC Standard InChIKey: PRJWEPRQDKFJHV-UHFFFAOYSA-N
- CAS Registry Number: 61219-63-4
- Chemical structure:
View 3d structure (requires JavaScript / HTML 5) - Permanent link for this species. Use this link for bookmarking this species for future reference.

Gas phase ion energetics data

Data compiled as indicated in comments:
RDSH - Henry M. Rosenstock, Keith Draxl, Bruce W. Steiner, and John T. Herron
B - John E. Bartmess
Electron affinity determinations
EA (eV) | Method | Reference | Comment |
---|---|---|---|
1.59 ± 0.16 | D-EA | Caldwell and Bartmess | value altered from reference due to change in acidity scale; B |
Ionization energy determinations
IE (eV) | Method | Reference | Comment |
---|---|---|---|
8.6 ± 0.1 | EI | Harrison, Kebarle, et al., 1961 | RDSH |

References

Caldwell and Bartmess
Caldwell, G.; Bartmess, J.E.,
, Unpublished results. [all data]
Harrison, Kebarle, et al., 1961
Harrison, A.G.; Kebarle, P.; Lossing, F.P.,
Free radicals by mass spectrometry. XXI. The ionization potentials of some meta and para substituted benzyl radicals,
J. Am. Chem. Soc., 1961, 83, 777. [all data]