1,5,9-Cyclododecatriyne
- Formula: C12H12
- Molecular weight: 156.2237
- IUPAC Standard InChIKey: PYXWKTZVNXGDJK-UHFFFAOYSA-N
- CAS Registry Number: 60323-50-4
- Chemical structure:
View 3d structure (requires JavaScript / HTML 5) - Permanent link for this species. Use this link for bookmarking this species for future reference.

Gas phase ion energetics data

Data compiled as indicated in comments:
LLK - Sharon G. Lias, Rhoda D. Levin, and Sherif A. Kafafi
Ionization energy determinations
IE (eV) | Method | Reference | Comment |
---|---|---|---|
9.0 | PE | Houk, Strozier, et al., 1979 | LLK |
9.24 | PE | Houk, Strozier, et al., 1979 | Vertical value; LLK |

References

Houk, Strozier, et al., 1979
Houk, K.N.; Strozier, R.W.; Santiago, C.; Gandour, R.W.; Vollhardt, K.P.C.,
Electronic structure and photoelectron spectrum of 1,5,9-cyclododecatriyne,
J. Am. Chem. Soc., 1979, 101, 5183. [all data]