Benzeneethanamine, N-methyl-
- Formula: C9H13N
- Molecular weight: 135.2062
- IUPAC Standard InChIKey: SASNBVQSOZSTPD-UHFFFAOYSA-N
- CAS Registry Number: 589-08-2
- Chemical structure:
View 3d structure (requires JavaScript / HTML 5) - Other names: Phenethylamine, N-methyl-; N-Methyl-β-phenylethylamine; N-Methyl-N-(2-phenylethyl)amine; N-Methylphenethylamine; α-Phenyl-β-methylaminoethane; N-Methyl-β-phenylaethylamin; WIN 5553; 1-Phenyl-2-methylamino-aethan; 1-Phenyl-2-methylaminoethane; N-Methyl-β-phenethylamine; N-Methyl-2-phenylethylamine; N-(Phenylethyl)methylamine; N-Methylbenzeneethanamine; N-Methylphenylethylamine; (2-Phenylethyl)methylamine; N-Phenethylmethylamine; NSC 113957; N-Methyl-2-phenethylamine

Phase change data

Data compiled by: Robert L. Brown and Stephen E. Stein
Quantity | Value | Units | Method | Reference | Comment |
---|---|---|---|---|---|
Tboil | 476.2 | K | N/A | Weast and Grasselli, 1989 |

Gas phase ion energetics data

Data compiled as indicated in comments:
LLK - Sharon G. Lias, Rhoda D. Levin, and Sherif A. Kafafi
Ionization energy determinations
IE (eV) | Method | Reference | Comment |
---|---|---|---|
8.4 | PE | Domelsmith, Munchausen, et al., 1977 | LLK |
8.66 ± 0.20 | PE | Domelsmith, Munchausen, et al., 1977 | Vertical value; LLK |

Kovats' RI, non-polar column, isothermal

Column type | Active phase | Temperature (C) | I | Reference | Comment |
---|---|---|---|---|---|
Packed | Apiezon L | 120. | 1154. | Donike and Stratmann, 1976 | Chromosorb W |

Kovats' RI, polar column, isothermal

Column type | Active phase | Temperature (C) | I | Reference | Comment |
---|---|---|---|---|---|
Packed | PEG-20M | 120. | 1571. | Donike and Stratmann, 1976 | Chromosorb W |

References

Weast and Grasselli, 1989
CRC Handbook of Data on Organic Compounds, 2nd Editon, Weast,R.C and Grasselli, J.G., ed(s)., CRC Press, Inc., Boca Raton, FL, 1989, 1. [all data]
Domelsmith, Munchausen, et al., 1977
Domelsmith, L.N.; Munchausen, L.L.; Houk, K.N.,
Photoelectron spectra of psychotropic drugs. 1. Phenethylamines, tryptamines, and LSD,
J. Am. Chem. Soc., 1977, 99, 4311. [all data]
Donike and Stratmann, 1976
Donike, M.; Stratmann, D.,
Gas-chromatographische identifizierung von stimulantien der phenyläthylaminreihe mit hilfe der retnetions-indices,
Z. Anal. Chem., 1976, 279, 2, 129-131, https://doi.org/10.1007/BF00440798
. [all data]