Methanesulfonyl fluoride
- Formula: CH3FO2S
- Molecular weight: 98.097
- IUPAC Standard InChIKey: KNWQLFOXPQZGPX-UHFFFAOYSA-N
- CAS Registry Number: 558-25-8
- Chemical structure:
View 3d structure (requires JavaScript / HTML 5) - Other names: Fumette; Methanesulphonyl fluoride; MSF; Fluoro methyl sulfone; Mesyl fluoride

Gas phase ion energetics data

Data compiled by: Sharon G. Lias, Rhoda D. Levin, and Sherif A. Kafafi
Ionization energy determinations
IE (eV) | Method | Reference | Comment |
---|---|---|---|
12.53 | PE | Solouki, Bock, et al., 1975 | Vertical value |
12.53 | PE | Solouki, Bock, et al., 1972 | Vertical value |
12.61 | PE | Mines, Thomas, et al., 1972 | Vertical value |

References

Solouki, Bock, et al., 1975
Solouki, B.; Bock, H.; Appel, R.,
Photoelektronenspektren und Molekuleigenschaften, XLV Schwefelsaure-Derivate X2SY2: Alkyl-, Vinyl- und Arylsulfone, Alkylsulfoimide und Sulfurylhalogenide,
Chem. Ber., 1975, 108, 897. [all data]
Solouki, Bock, et al., 1972
Solouki, B.; Bock, H.; Appel, R.,
Sequence of orbitals in sulfones and sulfodiimides,
Angew. Chem. Int. Ed. Engl., 1972, 11, 927. [all data]
Mines, Thomas, et al., 1972
Mines, G.W.; Thomas, R.K.; Thompson, H.,
Photoelectron spectra of compounds containing thionyl and sulphuryl groups,
Proc. R. Soc. London A:, 1972, 329, 275. [all data]