Ethenol
- Formula: C2H4O
- Molecular weight: 44.0526
- IUPAC Standard InChIKey: IMROMDMJAWUWLK-UHFFFAOYSA-N
- CAS Registry Number: 557-75-5
- Chemical structure:
View 3d structure (requires JavaScript / HTML 5) - Other names: vinyl alcohol

Gas phase thermochemistry data

Data compiled by: Hussein Y. Afeefy, Joel F. Liebman, and Stephen E. Stein
Quantity | Value | Units | Method | Reference | Comment |
---|---|---|---|---|---|
ΔfH°gas | -128. | kJ/mol | Ion | Turecek and Havlas, 1986 | |
ΔfH°gas | -125. ± 8.4 | kJ/mol | Ion | Holmes and Lossing, 1982 | |
ΔfH°gas | -111. ± 8.4 | kJ/mol | Ion | Holmes, Terlouw, et al., 1976 | Appearance potential |

Gas phase ion energetics data

Data compiled as indicated in comments:
LL - Sharon G. Lias and Joel F. Liebman
LBLHLM - Sharon G. Lias, John E. Bartmess, Joel F. Liebman, John L. Holmes, Rhoda D. Levin, and W. Gary Mallard
LLK - Sharon G. Lias, Rhoda D. Levin, and Sherif A. Kafafi
Ionization energy determinations
IE (eV) | Method | Reference | Comment |
---|---|---|---|
9.33 ± 0.01 | DER | Ruscic and Berkowitz, 1994 | LL |
9.17 ± 0.05 | PE | Matti, Osman, et al., 1989 | Anti-; LL |
9.30 ± 0.05 | PE | Matti, Osman, et al., 1989 | Syn-; LL |
9.3 ± 0.1 | EI | Iraqi, Pri-Bar, et al., 1986 | LBLHLM |
9.18 | PE | Albrecht, Allan, et al., 1984 | LBLHLM |
9.14 | DER | Holmes and Lossing, 1982, 2 | LBLHLM |
9.0 ± 0.15 | EI | Holmes, Terlouw, et al., 1976, 2 | LLK |
9.52 | PE | Albrecht, Allan, et al., 1984 | Vertical value; LBLHLM |
Appearance energy determinations
Ion | AE (eV) | Other Products | Method | Reference | Comment |
---|---|---|---|---|---|
C2H3O+ | 11.3 ± 0.1 | H | EI | Iraqi, Pri-Bar, et al., 1986 | LBLHLM |

Vibrational and/or electronic energy levels

Data compiled by: Marilyn E. Jacox
State: X
Additional references: Jacox, 1994, page 363; Jacox, 2003, page 337; Saito, 1976; Rodler and Bauder, 1984

References

Turecek and Havlas, 1986
Turecek, F.; Havlas, Z.,
Thermochemistry of unstable enols: the O-(Cd)(H) group equivalent,
J. Org. Chem., 1986, 51, 4066-4067. [all data]
Holmes and Lossing, 1982
Holmes, J.L.; Lossing, F.P.,
Heats of formation of the ionic and neutral enols of acetaldehyde and acetone,
J. Am. Chem. Soc., 1982, 104, 2648-2649. [all data]
Holmes, Terlouw, et al., 1976
Holmes, J.L.; Terlouw, J.K.; Lossing, F.P.,
The thermochemistry of C2H4O.+ ions,
J. Phys. Chem., 1976, 80, 2860-2862. [all data]
Ruscic and Berkowitz, 1994
Ruscic, B.; Berkowitz, J.,
The heats of formation of some C2H5O+ isomers, relevant bond energies in ethanol and PA(CH3CHO),
J. Chem. Phys., 1994, 101, 10936. [all data]
Matti, Osman, et al., 1989
Matti, G.Y.; Osman, O.I.; Upham, J.E.; Suffolk, R.J.,
Photoelectron spectroscopic detection of vinyl alcohol, CH2=CHOH: Evidence for the syn and anti rotamers,
J. Electron Spectrosc. Relat. Phenom., 1989, 49, 195. [all data]
Iraqi, Pri-Bar, et al., 1986
Iraqi, M.; Pri-Bar, I.; Lifshitz, C.,
Electron impact ionization of unstable enols: H2C=CHOH, H2C=C(OH)-CH3 and H2C=C(OH)-C2H5,
Org. Mass Spectrom., 1986, 21, 661. [all data]
Albrecht, Allan, et al., 1984
Albrecht, B.; Allan, M.; Haselbach, E.; Neuhaus, L.; Carrupt, P.-A.,
26. Molecular ions of transient species: Vinyl-alcohol cation,
Helv. Chim. Acta, 1984, 67, 216. [all data]
Holmes and Lossing, 1982, 2
Holmes, J.L.; Lossing, F.P.,
Heats of formation of the ionic and neutral enols of acetaldehyde and acetone,
J. Am. Chem. Soc., 1982, 104, 2648. [all data]
Holmes, Terlouw, et al., 1976, 2
Holmes, J.L.; Terlouw, J.K.; Lossing, F.P.,
The thermochemistry of C2H4O+ ions,
J. Phys. Chem., 1976, 80, 2860. [all data]
Koga, Nakanaga, et al., 1991
Koga, Y.; Nakanaga, T.; Sugawara, K.; Watanabe, A.; Sugie, M.; Takeo, H.; Kondo, S.; Matsumura, C.,
Gas phase infrared spectrum of syn-vinyl alcohol produced by thermal decomposition of several alcohols and aldehydes,
J. Mol. Spectrosc., 1991, 145, 2, 315, https://doi.org/10.1016/0022-2852(91)90119-U
. [all data]
Joo, Merer, et al., 1999
Joo, D.-L.; Merer, A.J.; Clouthier, D.J.,
High-Resolution Fourier Transform Infrared Spectroscopy of Vinyl Alcohol: Rotational Analysis of the ν13 CH2 Wagging Fundamental at 817 cm-1,
J. Mol. Spectrosc., 1999, 197, 1, 68, https://doi.org/10.1006/jmsp.1999.7877
. [all data]
Hawkins and Andrews, 1983
Hawkins, M.; Andrews, L.,
Reactions of atomic oxygen with ethene in solid argon. The infrared spectrum of vinyl alcohol,
J. Am. Chem. Soc., 1983, 105, 9, 2523, https://doi.org/10.1021/ja00347a001
. [all data]
Rodler, Blom, et al., 1984
Rodler, M.; Blom, C.E.; Bauder, A.,
Infrared spectrum and general valence force field of syn-vinyl alcohol,
J. Am. Chem. Soc., 1984, 106, 14, 4029, https://doi.org/10.1021/ja00326a025
. [all data]
Jacox, 1994
Jacox, M.E.,
Vibrational and electronic energy levels of polyatomic transient molecules, American Chemical Society, Washington, DC, 1994, 464. [all data]
Jacox, 2003
Jacox, M.E.,
Vibrational and electronic energy levels of polyatomic transient molecules: supplement B,
J. Phys. Chem. Ref. Data, 2003, 32, 1, 1-441, https://doi.org/10.1063/1.1497629
. [all data]
Saito, 1976
Saito, S.,
Microwave spectroscopic detection of vinyl alcohol, CH2«58875»CHOH,
Chem. Phys. Lett., 1976, 42, 3, 399, https://doi.org/10.1016/0009-2614(76)80638-0
. [all data]
Rodler and Bauder, 1984
Rodler, M.; Bauder, A.,
Structure of syn-vinyl alcohol determined by microwave spectroscopy,
J. Am. Chem. Soc., 1984, 106, 14, 4025, https://doi.org/10.1021/ja00326a024
. [all data]