Glycidol
- Formula: C3H6O2
- Molecular weight: 74.0785
- IUPAC Standard InChIKey: CTKINSOISVBQLD-UHFFFAOYSA-N
- CAS Registry Number: 556-52-5
- Chemical structure:
- Other names: Oxiranemethanol; 1-Propanol, 2,3-epoxy-; Allyl alcohol oxide; Epihydrin alcohol; Glycide; Glycidyl alcohol; 1-Hydroxy-2,3-epoxypropane; 1,2-Epoxy-3-hydroxypropane; 2-(Hydroxymethyl)oxirane; 2,3-Epoxy-1-propanol; 3-Hydroxy-1,2-epoxypropane; 3-Hydroxypropylene oxide; Hydroxymethyloxirane; 2,3-Epoxypropanol-1; Methanol, oxiranyl-; Monoepoxide glycidol; NCI-C55549; Oxiranylmethanol; 2,3-Epoxypropanol; Hydroxymethyl ethylene oxide; Epoxypropyl alcohol; 2-Oxiranemethanol; NSC 46096; 2,3-epoxypropan-1-ol

Gas phase ion energetics data

Data compiled as indicated in comments:
LL - Sharon G. Lias and Joel F. Liebman
LLK - Sharon G. Lias, Rhoda D. Levin, and Sherif A. Kafafi
Ionization energy determinations
IE (eV) | Method | Reference | Comment |
---|---|---|---|
10.43 | EI | Vorob'ev, Furlei, et al., 1989 | Vertical value; LL |
Appearance energy determinations
Ion | AE (eV) | Other Products | Method | Reference | Comment |
---|---|---|---|---|---|
C2H4O+ | 10.30 | CH2O | EI | Holmes, Terlouw, et al., 1976 | LLK |

Kovats' RI, non-polar column, isothermal

Column type | Active phase | Temperature (C) | I | Reference | Comment |
---|---|---|---|---|---|
Packed | Silicon High Vacuum Grease (obsolete) | 170. | 755. | Janák, Jonas, et al., 1965 | H2, Celite |

Condensed phase thermochemistry data

Data compiled by: Hussein Y. Afeefy, Joel F. Liebman, and Stephen E. Stein
Quantity | Value | Units | Method | Reference | Comment |
---|---|---|---|---|---|
ΔfH°liquid | -71.3 ± 0.2 | kcal/mol | Ccr | Bjellerup and Smith, 1954 | At 293 K |
Quantity | Value | Units | Method | Reference | Comment |
ΔcH°liquid | -415.9 ± 0.2 | kcal/mol | Ccr | Bjellerup and Smith, 1954 | At 293 K; Corresponding ΔfHºliquid = -71.2 kcal/mol (simple calculation by NIST; no Washburn corrections) |

Phase change data

Data compiled by: Robert L. Brown and Stephen E. Stein
Quantity | Value | Units | Method | Reference | Comment |
---|---|---|---|---|---|
Tboil | 433.7 | K | N/A | Aldrich Chemical Company Inc., 1990 |

References

Vorob'ev, Furlei, et al., 1989
Vorob'ev, A.S.; Furlei, I.I.; Sultanov, A.S.; Khvostenko, V.I.; Leplyanin, G.V.; Derzhinskii, A.R.; Tolstikov, G.A.,
Mass spectrometry of reasonance capture of electrons and photoelectron spectroscopy of molecules of ethylene oxide, ethylene sulfide, and their derivatives,
Bull. Acad. Sci. USSR, Div. Chem. Sci., 1989, 1388. [all data]
Holmes, Terlouw, et al., 1976
Holmes, J.L.; Terlouw, J.K.; Lossing, F.P.,
The thermochemistry of C2H4O+ ions,
J. Phys. Chem., 1976, 80, 2860. [all data]
Janák, Jonas, et al., 1965
Janák, J.; Jonas, J.; Kratochvíl, M.,
Identification of some acetals of the tetrahydrofurane sereis by gas chromatography with the aid of the Kováts indices,
Collect. Czech. Chem. Commun., 1965, 30, 1, 265-276, https://doi.org/10.1135/cccc19650265
. [all data]