thionyl dibromide
- Formula: Br2OS
- Molecular weight: 207.872
- IUPAC Standard InChIKey: HFRXJVQOXRXOPP-UHFFFAOYSA-N
- CAS Registry Number: 507-16-4
- Chemical structure:
View 3d structure (requires JavaScript / HTML 5) - Other names: Thionyl bromide

Phase change data

Data compiled as indicated in comments:
AC - William E. Acree, Jr., James S. Chickos
Enthalpy of vaporization
ΔvapH (kJ/mol) | Temperature (K) | Reference | Comment |
---|---|---|---|
43.6 | 330. | Dykyj, Svoboda, et al., 1999 | Based on data from 313. to 439. K.; AC |
Antoine Equation Parameters
log10(P) = A − (B / (T + C))
P = vapor pressure (bar)
T = temperature (K)
View plot Requires a JavaScript / HTML 5 canvas capable browser.
Temperature (K) | A | B | C | Reference | Comment |
---|---|---|---|---|---|
266.4 to 412.7 | 5.34386 | 2231.287 | 5.082 | Stull, 1947 | Coefficents calculated by NIST from author's data. |

Gas phase ion energetics data

Data compiled as indicated in comments:
LLK - Sharon G. Lias, Rhoda D. Levin, and Sherif A. Kafafi
Ionization energy determinations
IE (eV) | Method | Reference | Comment |
---|---|---|---|
10.54 | PE | Bock and Solouki, 1974 | Vertical value; LLK |
10.63 | PE | Mines, Thomas, et al., 1972 | Vertical value; LLK |

Vibrational and/or electronic energy levels

Data compiled by: Takehiko Shimanouchi
Symmetry: Cs Symmetry Number σ = 1
Sym. | No | Approximate | Selected Freq. | Infrared | Raman | Comments | ||||
---|---|---|---|---|---|---|---|---|---|---|
Species | type of mode | Value | Rating | Value | Phase | Value | Phase | |||
a' | 1 | SO str | 1121 | D | 1121 p | gas | ||||
a' | 2 | SBr s-str | 405 | D | 405 p | liq. | ||||
a' | 3 | OSBr deform | 267 | D | 267 p | liq. | ||||
a' | 4 | SBr2 scis | 120 | D | 120 p | liq. | ||||
a | 5 | SBr2 a-str | 379 | D | 379 dp | liq. | ||||
a | 6 | OSBr deform | 223 | D | 223 dp | liq. | ||||
Source: Shimanouchi, 1972

References

Dykyj, Svoboda, et al., 1999
Dykyj, J.; Svoboda, J.; Wilhoit, R.C.; Frenkel, M.L.; Hall, K.R.,
Vapor Pressure of Chemicals: Part A. Vapor Pressure and Antoine Constants for Hydrocarbons and Sulfur, Selenium, Tellurium and Hydrogen Containing Organic Compounds, Springer, Berlin, 1999, 373. [all data]
Stull, 1947
Stull, Daniel R.,
Vapor Pressure of Pure Substances. Organic and Inorganic Compounds,
Ind. Eng. Chem., 1947, 39, 4, 517-540, https://doi.org/10.1021/ie50448a022
. [all data]
Bock and Solouki, 1974
Bock, H.; Solouki, B.,
Photoelektronenspektren und molekuleigenschaften, XXXV. Sulfoxide X2SO - beispiele fur den nutzen von korrelations - diagrammen bei der diskussion von substituenteneffekten und von geometrischen storungen,
Chem. Ber., 1974, 107, 2299. [all data]
Mines, Thomas, et al., 1972
Mines, G.W.; Thomas, R.K.; Thompson, H.,
Photoelectron spectra of compounds containing thionyl and sulphuryl groups,
Proc. R. Soc. London A:, 1972, 329, 275. [all data]
Shimanouchi, 1972
Shimanouchi, T.,
Tables of Molecular Vibrational Frequencies Consolidated Volume II,
J. Phys. Chem. Ref. Data, 1972, 6, 3, 993-1102. [all data]