D-Lysergic acid N,N-diethylamide
- Formula: C20H25N3O
- Molecular weight: 323.4320
- IUPAC Standard InChIKey: VAYOSLLFUXYJDT-UHFFFAOYSA-N
- CAS Registry Number: 50-37-3
- Chemical structure:
View 3d structure (requires JavaScript / HTML 5) - Other names: Lysergide; Ergoline-8-carboxamide, 9,10-didehydro-N,N-diethyl-6-methyl-, (8β)-; Ergoline-8β-carboxamide, 9,10-didehydro-N,N-diethyl-6-methyl-; (+)-LSD; D-Lysergic acid diethylamide; D-LSD; D-LSD-25; Delysid; Dextrolysergic acid diethylamide; Lysergic acid diethylamide; Lysergic acid diethylamide-25; Lysergsaure diethylamid; LSD (Alkaloid); LSD 25; N,N-Diethyl-(+)-Lysergamide; N,N-Diethyl-D-lysergamide; N,N-Diethyllysergamide; Acid [street name]; Cubes [street name]; 9,10-Didehydro-N,N-diethyl-6-methyl-ergoline-8-β-carboxamide; Diethylamid kyseliny lysergove; Heavenly blue [street name]; Lysergamid; Lysergamide, N,N-diethyl-; Lysergaure diethylamid; Lysergsauerediaethylamid; Pearly gates [street name]; Royal blue [street name]; Wedding bells [street name]; Indolo[4,3-fg]quinoline, ergoline-8-carboxamide deriv.; d-Lysergic acid dethylamide; LSD

Gas phase ion energetics data

Data compiled by: Sharon G. Lias, Rhoda D. Levin, and Sherif A. Kafafi
Ionization energy determinations
IE (eV) | Method | Reference | Comment |
---|---|---|---|
7.25 ± 0.10 | PE | Domelsmith, Munchausen, et al., 1977 | Vertical value |

References

Domelsmith, Munchausen, et al., 1977
Domelsmith, L.N.; Munchausen, L.L.; Houk, K.N.,
Photoelectron spectra of psychotropic drugs. 1. Phenethylamines, tryptamines, and LSD,
J. Am. Chem. Soc., 1977, 99, 4311. [all data]