Juglone
- Formula: C10H6O3
- Molecular weight: 174.1528
- IUPAC Standard InChIKey: KQPYUDDGWXQXHS-UHFFFAOYSA-N
- CAS Registry Number: 481-39-0
- Chemical structure:
View 3d structure (requires JavaScript / HTML 5) - Other names: 1,4-Naphthalenedione, 5-hydroxy-; 1,4-Naphthoquinone, 5-hydroxy-; Akhnot; C.I. Natural Brown 7; C.I. 75500; Iuglon; Juglane; Juglon; Nucin; Regianin; Walnut Extract; Yuglon; 5-Hydroxy-1,4-naphthoquinone; 5-Hydroxynaphthoquinone; 8-Hydroxy-1,4-naphthoquinone; Jugnlon; NCI 2323; 1,4-Naphthoquinone, 8-hydroxy-; 5-Hydroxy-1,4-naftochinon; 5-Hydroxy-1,4-naphthalenedione; 5-Hydroxy-p-naphthoquinone; 8-Hydroxy-1,4-naphthalenedione; 1,4-Dihydro-1,4-dioxo-5-hydroxynaphthalene; NSC 153189; NSC 622948

Gas phase ion energetics data

Data compiled as indicated in comments:
LL - Sharon G. Lias and Joel F. Liebman
LLK - Sharon G. Lias, Rhoda D. Levin, and Sherif A. Kafafi
Ionization energy determinations
IE (eV) | Method | Reference | Comment |
---|---|---|---|
8.6 | PE | Millefiori, Gulino, et al., 1990 | LL |
8.70 ± 0.02 | PI | Potapov and Sorokin, 1971 | LLK |
8.85 | PE | Millefiori, Gulino, et al., 1990 | Vertical value; LL |

References

Millefiori, Gulino, et al., 1990
Millefiori, S.; Gulino, A.; Casarin, M.,
UV Photoelectron spectra, reduction potentials and MO calculations of intramolecularly hydrogen-bonded naphtoquinones,
J. Chim. Phys., 1990, 87, 317. [all data]
Potapov and Sorokin, 1971
Potapov, V.K.; Sorokin, V.V.,
Photoionization and ion-molecule reactions in quinones and alcohols,
High Energy Chem., 1971, 5, 435, In original 487. [all data]