1-Fluoropropenenitrile
- Formula: C3H2FN
- Molecular weight: 71.0531
- IUPAC Standard InChIKey: DOERUWDOBMTXGO-OWOJBTEDSA-N
- CAS Registry Number: 430-49-9
- Chemical structure:
View 3d structure (requires JavaScript / HTML 5) - Permanent link for this species. Use this link for bookmarking this species for future reference.

Gas phase ion energetics data

Data compiled by: Henry M. Rosenstock, Keith Draxl, Bruce W. Steiner, and John T. Herron
Ionization energy determinations
IE (eV) | Method | Reference |
---|---|---|
10.7 ± 0.1 | EI | Chelobov, Dubov, et al., 1969 |
Appearance energy determinations
Ion | AE (eV) | Other Products | Method | Reference | Comment |
---|---|---|---|---|---|
CF+ | 14.2 ± 0.1 | ? | EI | Chelobov, Dubov, et al., 1969 | |
C2HF+ | 13.6 ± 0.1 | ? | EI | Chelobov, Dubov, et al., 1969 | |
C3HN+ | 16.3 ± 0.1 | ? | EI | Chelobov, Dubov, et al., 1969 |

References

Chelobov, Dubov, et al., 1969
Chelobov, F.N.; Dubov, S.S.; Tikhomirov, M.V.; Dobrovitskii, M.I.; Gitel', P.O.; Rozenshtein, S.M.,
Processes in fluoroacrylonitriles under electron impact,
Zh. Fiz. Khim., 1969, 43, 33, In original 15. [all data]