Thiirane
- Formula: C2H4S
- Molecular weight: 60.118
- IUPAC Standard InChIKey: VOVUARRWDCVURC-UHFFFAOYSA-N
- CAS Registry Number: 420-12-2
- Chemical structure:
View 3d structure (requires JavaScript / HTML 5) - Other names: Ethylene sulfide; Ethylene episulfide; Thiacyclopropane; Thiirene, 2,3-dihydro-; 2,3-Dihydrothiirene; Ethylene episulphide; Ethylene sulphide; NSC 89690; epithioethane

Gas phase thermochemistry data

Data compiled by: Donald R. Burgess, Jr.
Quantity | Value | Units | Method | Reference | Comment |
---|---|---|---|---|---|
ΔfH°gas | 82.3 ± 1.0 | kJ/mol | N/A | Sunner, 1963 | Value computed using ΔfHliquid° value of 52±1 kj/mol from Sunner, 1963 and ΔvapH° value of 30.3±0.2 kj/mol from missing citation. |

Condensed phase thermochemistry data

Data compiled by: Hussein Y. Afeefy, Joel F. Liebman, and Stephen E. Stein
Quantity | Value | Units | Method | Reference | Comment |
---|---|---|---|---|---|
ΔfH°liquid | 52. ± 1. | kJ/mol | Ccr | Sunner, 1963 | See Sunner, 1962 |
Quantity | Value | Units | Method | Reference | Comment |
ΔcH°liquid | -2012.6 | kJ/mol | Ccr | Sunner, 1963 | See Sunner, 1962 |

Phase change data

Data compiled as indicated in comments:
BS - Robert L. Brown and Stephen E. Stein
TRC - Thermodynamics Research Center, NIST Boulder Laboratories, Chris Muzny director
AC - William E. Acree, Jr., James S. Chickos
ALS - Hussein Y. Afeefy, Joel F. Liebman, and Stephen E. Stein
Quantity | Value | Units | Method | Reference | Comment |
---|---|---|---|---|---|
Tboil | 328.7 | K | N/A | Aldrich Chemical Company Inc., 1990 | BS |
Tboil | 328.9 | K | N/A | Lecat, 1947 | Uncertainty assigned by TRC = 0.5 K; TRC |
Tboil | 329. | K | N/A | Jones and Reid, 1938 | Uncertainty assigned by TRC = 3. K; TRC |
Quantity | Value | Units | Method | Reference | Comment |
ΔvapH° | 30.3 | kJ/mol | N/A | Reid, 1972 | AC |
ΔvapH° | 30.3 ± 0.2 | kJ/mol | V | Guthrie, Scott, et al., 1952 | ALS |
Enthalpy of vaporization
ΔvapH (kJ/mol) | Temperature (K) | Method | Reference | Comment |
---|---|---|---|---|
30.5 | 306. | A | Stephenson and Malanowski, 1987 | Based on data from 291. to 361. K. See also Guthrie, Scott, et al., 1952, 2 and Dykyj, Svoboda, et al., 1999.; AC |
Antoine Equation Parameters
log10(P) = A − (B / (T + C))
P = vapor pressure (bar)
T = temperature (K)
View plot Requires a JavaScript / HTML 5 canvas capable browser.
Temperature (K) | A | B | C | Reference | Comment |
---|---|---|---|---|---|
291.44 to 360.88 | 4.15626 | 1190.802 | -41.175 | Guthrie, Scott, et al., 1952, 2 | Coefficents calculated by NIST from author's data. |

Gas phase ion energetics data

Data evaluated as indicated in comments:
HL - Edward P. Hunter and Sharon G. Lias
Data compiled as indicated in comments:
LL - Sharon G. Lias and Joel F. Liebman
LBLHLM - Sharon G. Lias, John E. Bartmess, Joel F. Liebman, John L. Holmes, Rhoda D. Levin, and W. Gary Mallard
LLK - Sharon G. Lias, Rhoda D. Levin, and Sherif A. Kafafi
RDSH - Henry M. Rosenstock, Keith Draxl, Bruce W. Steiner, and John T. Herron
Quantity | Value | Units | Method | Reference | Comment |
---|---|---|---|---|---|
Proton affinity (review) | 807.4 | kJ/mol | N/A | Hunter and Lias, 1998 | HL |
Quantity | Value | Units | Method | Reference | Comment |
Gas basicity | 777.6 | kJ/mol | N/A | Hunter and Lias, 1998 | HL |
Ionization energy determinations
IE (eV) | Method | Reference | Comment |
---|---|---|---|
9.05 | PIPECO | Butler and Baer, 1983 | LBLHLM |
9.04 ± 0.01 | PI | Butler and Baer, 1982 | LBLHLM |
8.9 ± 0.1 | PE | Aue, Webb, et al., 1980 | LLK |
8.9 | PE | Aue and Bowers, 1979 | LLK |
9.00 | PE | Schweig and Thiel, 1973 | LLK |
9.051 ± 0.006 | S | Basco and Morse, 1973 | LLK |
8.87 ± 0.15 | EI | Gallegos and Kiser, 1961 | RDSH |
9.0 | EI | Vorob'ev, Furlei, et al., 1989 | Vertical value; LL |
9.05 | PE | Frost, Herring, et al., 1973 | Vertical value; LLK |
Appearance energy determinations
Ion | AE (eV) | Other Products | Method | Reference | Comment |
---|---|---|---|---|---|
CHS+ | 11.07 ± 0.04 | CH3 | PI | Butler and Baer, 1982 | T = 298K; LBLHLM |
CHS+ | 11.13 ± 0.04 | CH3 | PI | Butler and Baer, 1982 | T = 0K; LBLHLM |
CHS+ | 12.3 ± 0.2 | CH3 | EI | Gallegos and Kiser, 1961 | RDSH |
CH2+ | 20.4 ± 0.5 | ? | EI | Gallegos and Kiser, 1961 | RDSH |
CH2S+ | 12.7 ± 0.2 | ? | EI | Gallegos and Kiser, 1961 | RDSH |
C2H2+ | 17.9 ± 0.5 | ? | EI | Gallegos and Kiser, 1961 | RDSH |
C2H2S+ | 15.0 ± 0.2 | ? | EI | Gallegos and Kiser, 1961 | RDSH |
C2H3+ | 14.0 | SH | EI | Haney and Franklin, 1968 | RDSH |
C2H3S+ | 10.7 | H | PIPECO | Butler and Baer, 1983 | LBLHLM |
C2H3S+ | 11.4 ± 0.2 | H | EI | Gallegos and Kiser, 1961 | RDSH |
H2S+ | 13.4 | C2H2 | EI | Haney and Franklin, 1968 | RDSH |
H2S+ | 13.4 ± 0.1 | C2H2 | EI | Gallegos and Kiser, 1961 | RDSH |
S+ | 13.1 ± 0.2 | C2H4 | EI | Gallegos and Kiser, 1961 | RDSH |

Vibrational and/or electronic energy levels

Data compiled by: Marilyn E. Jacox
State: X
Additional references: Jacox, 1994, page 256; Krantz and Laureni, 1979; Allen, Bertie, et al., 1986

Kovats' RI, non-polar column, isothermal

Column type | Active phase | Temperature (C) | I | Reference | Comment |
---|---|---|---|---|---|
Packed | Apiezon M | 130. | 606. | Garbuzov, Misharina, et al., 1985 | He or N2, Chromosorb W, AW-DMCS; Column length: 2.1 m |

Normal alkane RI, non-polar column, temperature ramp

Column type | Active phase | I | Reference | Comment |
---|---|---|---|---|
Capillary | OV-101 | 588. | Zenkevich, 2005 | 25. m/0.20 mm/0.10 μm, N2/He, 6. K/min; Tstart: 50. C; Tend: 250. C |
Capillary | DB-5 | 589. | Macku and Shibamoto, 1991 | He, 40. C @ 5. min, 2. K/min; Column length: 60. m; Column diameter: 0.25 mm; Tend: 160. C |

Normal alkane RI, non-polar column, custom temperature program

Column type | Active phase | I | Reference | Comment |
---|---|---|---|---|
Capillary | Methyl Silicone | 588. | Farkas, Héberger, et al., 2004 | Program: not specified |
Capillary | CP Sil 5 CB | 606. | Gijs, Piraprez, et al., 2000 | 50. m/0.32 mm/1.2 μm, He; Program: 33C (16.5min) => 2C/min => 160C => 20C/min => 200C (9min) |

Normal alkane RI, polar column, temperature ramp

Column type | Active phase | I | Reference | Comment |
---|---|---|---|---|
Capillary | DB-Wax | 899. | Horiuchi, Umano, et al., 1998 | 60. m/0.25 mm/1. μm, He, 3. K/min, 200. C @ 40. min; Tstart: 50. C |

References

Sunner, 1963
Sunner, S.,
Corrected heat of combustion and formation values for a number of organic sulphur compounds,
Acta Chem. Scand., 1963, 17, 728-730. [all data]
Sunner, 1962
Sunner, S.,
Corrected heat of combustion and formation values for a number of organic sulphur compounds,
Private communication, 1962, 1-4. [all data]
Aldrich Chemical Company Inc., 1990
Aldrich Chemical Company Inc.,
Catalog Handbook of Fine Chemicals, Aldrich Chemical Company, Inc., Milwaukee WI, 1990, 1. [all data]
Lecat, 1947
Lecat, M.,
Orthobaric Azeotropes of Sulfides,
Bull. Cl. Sci., Acad. R. Belg., 1947, 33, 160-82. [all data]
Jones and Reid, 1938
Jones, S.O.; Reid, E.E.,
The Addition of Sulfurl, Hydrogen Sulfide and Mercaptans to Unsaturated Hydrocarbons,
J. Am. Chem. Soc., 1938, 60, 2452. [all data]
Reid, 1972
Reid, Robert C.,
Handbook on vapor pressure and heats of vaporization of hydrocarbons and related compounds, R. C. Wilhort and B. J. Zwolinski, Texas A Research Foundation. College Station, Texas(1971). 329 pages.$10.00,
AIChE J., 1972, 18, 6, 1278-1278, https://doi.org/10.1002/aic.690180637
. [all data]
Guthrie, Scott, et al., 1952
Guthrie, G.B., Jr.; Scott, D.W.; Waddington, G.,
Thiacyclopropane (ethylene sulfide): Infrared spectrum, vapor pressure and some thermodynamic properties,
J. Am. Chem. Soc., 1952, 74, 2795-28. [all data]
Stephenson and Malanowski, 1987
Stephenson, Richard M.; Malanowski, Stanislaw,
Handbook of the Thermodynamics of Organic Compounds, 1987, https://doi.org/10.1007/978-94-009-3173-2
. [all data]
Guthrie, Scott, et al., 1952, 2
Guthrie, G.B.; Scott, D.W.; Waddington, Guy,
Thiacyclopropane (Ethylene Sulfide): Infrared Spectrum, Vapor Pressure and Some Thermodynamic Properties 1,
J. Am. Chem. Soc., 1952, 74, 11, 2795-2800, https://doi.org/10.1021/ja01131a028
. [all data]
Dykyj, Svoboda, et al., 1999
Dykyj, J.; Svoboda, J.; Wilhoit, R.C.; Frenkel, M.L.; Hall, K.R.,
Vapor Pressure of Chemicals: Part A. Vapor Pressure and Antoine Constants for Hydrocarbons and Sulfur, Selenium, Tellurium and Hydrogen Containing Organic Compounds, Springer, Berlin, 1999, 373. [all data]
Hunter and Lias, 1998
Hunter, E.P.; Lias, S.G.,
Evaluated Gas Phase Basicities and Proton Affinities of Molecules: An Update,
J. Phys. Chem. Ref. Data, 1998, 27, 3, 413-656, https://doi.org/10.1063/1.556018
. [all data]
Butler and Baer, 1983
Butler, J.J.; Baer, T.,
A photoionization study of organosulfur ring compounds: Thiirane, thietane and tetrahydrothiophene,
Org. Mass Spectrom., 1983, 18, 248. [all data]
Butler and Baer, 1982
Butler, J.J.; Baer, T.,
Photoionization study of the heat of formation of HCS+,
J. Am. Chem. Soc., 1982, 104, 5016. [all data]
Aue, Webb, et al., 1980
Aue, D.H.; Webb, H.M.; Davidson, W.R.; Vidal, M.; Bowers, M.T.; Goldwhite, H.; Vertal, L.E.; Douglas, J.E.; Kollman, P.A.; Kenyon, G.L.,
Proton affinities photoelectron spectra of three-membered-ring J. Heterocycl. Chem.,
J. Am. Chem. Soc., 1980, 102, 5151. [all data]
Aue and Bowers, 1979
Aue, D.H.; Bowers, M.T.,
Chapter 9. Stabilities of positive ions from equilibrium gas phase basicity measurements
in Ions Chemistry,, ed. M.T. Bowers, 1979. [all data]
Schweig and Thiel, 1973
Schweig, A.; Thiel, W.,
Photoionization cross sections: He I and He II photoelectron spectra of saturated three-membered rings,
Chem. Phys. Lett., 1973, 21, 541. [all data]
Basco and Morse, 1973
Basco, N.; Morse, R.D.,
Analysis of the Rydberg transitions in ethylene sulphide,
Chem. Phys. Lett., 1973, 20, 404. [all data]
Gallegos and Kiser, 1961
Gallegos, E.; Kiser, R.W.,
Electron impact spectroscopy of ethylene sulfide and ethylenimine,
J. Phys. Chem., 1961, 65, 1177. [all data]
Vorob'ev, Furlei, et al., 1989
Vorob'ev, A.S.; Furlei, I.I.; Sultanov, A.S.; Khvostenko, V.I.; Leplyanin, G.V.; Derzhinskii, A.R.; Tolstikov, G.A.,
Mass spectrometry of reasonance capture of electrons and photoelectron spectroscopy of molecules of ethylene oxide, ethylene sulfide, and their derivatives,
Bull. Acad. Sci. USSR, Div. Chem. Sci., 1989, 1388. [all data]
Frost, Herring, et al., 1973
Frost, D.C.; Herring, F.G.; Katrib, A.; McDowell, C.A.,
The photoelectron spectrum of ethylene sulphide,
Chem. Phys. Lett., 1973, 20, 401. [all data]
Haney and Franklin, 1968
Haney, M.A.; Franklin, J.L.,
Correlation of excess energies of electron-impact dissociations with the translational energies of the products,
J.Chem. Phys., 1968, 48, 4093. [all data]
Krantz and Laureni, 1977
Krantz, A.; Laureni, J.,
A methodology for the preparation and characterization of three-membered, potentially antiaromatic molecules. Preparation of matrix-isolated thiirene and selenirene,
J. Am. Chem. Soc., 1977, 99, 14, 4842, https://doi.org/10.1021/ja00456a060
. [all data]
Torres, Clement, et al., 1978
Torres, M.; Clement, A.; Bertie, J.E.; Gunning, H.E.; Strausz, O.P.,
Low-temperature matrix isolation of thiirenes,
J. Org. Chem., 1978, 43, 12, 2490, https://doi.org/10.1021/jo00406a045
. [all data]
Torres, Safarik, et al., 1979
Torres, M.; Safarik, I.; Clement, A.; Bertie, J.E.; Strausz, O.P.,
Nouv. J. Chim., 1979, 3, 365. [all data]
Krantz and Laureni, 1981
Krantz, A.; Laureni, J.,
Characterization of matrix-isolated antiaromatic three-membered heterocycles. Preparation of the elusive thiirene molecule,
J. Am. Chem. Soc., 1981, 103, 3, 486, https://doi.org/10.1021/ja00393a002
. [all data]
Laureni, Krantz, et al., 1976
Laureni, J.; Krantz, A.; Hajdu, R.A.,
Photolysis of isotopically labeled 1,2,3-selenadiazole and 1,2,3-thiadiazole,
J. Am. Chem. Soc., 1976, 98, 24, 7872, https://doi.org/10.1021/ja00440a095
. [all data]
Hawkins, Almond, et al., 1985
Hawkins, M.; Almond, M.J.; Downs, A.J.,
Photochemistry of low-temperature matrixes containing carbonyl sulfide: reactions of sulfur atoms with the phosphorus trihalides phosphorus trifluoride (PF3) and phosphorus trichloride (PCl3) and the hydrocarbons methane, ethene, and ethyne,
J. Phys. Chem., 1985, 89, 15, 3326, https://doi.org/10.1021/j100261a034
. [all data]
Jacox, 1994
Jacox, M.E.,
Vibrational and electronic energy levels of polyatomic transient molecules, American Chemical Society, Washington, DC, 1994, 464. [all data]
Krantz and Laureni, 1979
Krantz, A.; Laureni, J.,
The spectrum of matrix-isolated thiirene and characterization of new matrix-isolated species. Comment,
J. Org. Chem., 1979, 44, 15, 2730, https://doi.org/10.1021/jo01329a028
. [all data]
Allen, Bertie, et al., 1986
Allen, W.D.; Bertie, J.E.; Falk, M.V.; Hess, B.A., Jr.; Mast, G.B.; Othen, D.A.; Schaad, L.J.; Schaefer, H.F., III,
The experimental vibrational spectra, vibrational assignment, and normal coordinate analysis of thiirane-h4 and -d4 and cis- and trans-1,2-dideuteriothiirane: Ab initio theoretical IR spectra of thiirane, thiirene, and isotopically substituted derivatives,
J. Chem. Phys., 1986, 84, 8, 4211, https://doi.org/10.1063/1.450043
. [all data]