2-Butanone, 3-chloro-
- Formula: C4H7ClO
- Molecular weight: 106.551
- IUPAC Standard InChIKey: OIMRLHCSLQUXLL-UHFFFAOYSA-N
- CAS Registry Number: 4091-39-8
- Chemical structure:
View 3d structure (requires JavaScript / HTML 5) - Other names: 3-Chloro-2-butanone; 3-Chlorobutanone; 1-Chloroethyl methyl ketone; 2-Chloro-3-butanone; 3-chlorobutan-2-one

Phase change data

Data compiled as indicated in comments:
BS - Robert L. Brown and Stephen E. Stein
AC - William E. Acree, Jr., James S. Chickos
Quantity | Value | Units | Method | Reference | Comment |
---|---|---|---|---|---|
Tboil | 388.2 | K | N/A | Weast and Grasselli, 1989 | BS |
Enthalpy of vaporization
ΔvapH (kJ/mol) | Temperature (K) | Method | Reference | Comment |
---|---|---|---|---|
38.8 | 328. | A | Stephenson and Malanowski, 1987 | Based on data from 313. to 389. K.; AC |

Gas phase ion energetics data

Data compiled by: Sharon G. Lias and Joel F. Liebman
Appearance energy determinations
Ion | AE (eV) | Other Products | Method | Reference | Comment |
---|---|---|---|---|---|
C2H3O+ | 10.12 | ClCHCH3 | EI | Holmes and Lossing, 1988 |

Normal alkane RI, non-polar column, temperature ramp

Column type | Active phase | I | Reference | Comment |
---|---|---|---|---|
Capillary | OV-101 | 704. | Zenkevich, Eliseenkov, et al., 2011 | 25. m/0.20 mm/0.25 μm, Nitrogen, 6. K/min; Tstart: 40. C; Tend: 240. C |
Capillary | OV-101 | 704. | Zenkevich, Eliseenkov, et al., 2011 | 25. m/0.20 mm/0.25 μm, Nitrogen, 6. K/min; Tstart: 40. C; Tend: 240. C |
Capillary | OV-101 | 704. | Zenkevich, Eliseenkov, et al., 2011 | 25. m/0.20 mm/0.25 μm, Nitrogen, 6. K/min; Tstart: 40. C; Tend: 240. C |
Capillary | OV-101 | 704. | Zenkevich, Eliseenkov, et al., 2011 | 25. m/0.20 mm/0.25 μm, Nitrogen, 6. K/min; Tstart: 40. C; Tend: 240. C |
Capillary | OV-101 | 748. | Zenkevich, 2005 | 25. m/0.20 mm/0.10 μm, N2/He, 6. K/min; Tstart: 50. C; Tend: 250. C |

References

Weast and Grasselli, 1989
CRC Handbook of Data on Organic Compounds, 2nd Editon, Weast,R.C and Grasselli, J.G., ed(s)., CRC Press, Inc., Boca Raton, FL, 1989, 1. [all data]
Stephenson and Malanowski, 1987
Stephenson, Richard M.; Malanowski, Stanislaw,
Handbook of the Thermodynamics of Organic Compounds, 1987, https://doi.org/10.1007/978-94-009-3173-2
. [all data]
Holmes and Lossing, 1988
Holmes, J.L.; Lossing, F.P.,
Heats of formation and bond dissociation energies in halogen-substituted methyl and ethyl radicals,
J. Am. Chem. Soc., 1988, 110, 7343. [all data]
Zenkevich, Eliseenkov, et al., 2011
Zenkevich, I.G.; Eliseenkov, E.V.; Kasatochkin, A.N.; Zhakovskaya, Z.A.; Khoroshko, L.O.,
Gas chromatographic identification of chlorination products of aliphatic ketones,
J. Chromatogr., 2011, 1218, 21, 3291-3299, https://doi.org/10.1016/j.chroma.2010.12.056
. [all data]
Zenkevich, 2005
Zenkevich, I.G.,
Experimentally measured retention indices., 2005. [all data]