Disilane,pentamethyl(2-phenylethenyl)-,(E)-
- Formula: C13H22Si2
- Molecular weight: 234.4848
- IUPAC Standard InChIKey: DGOKJOCHXBTAIU-VAWYXSNFSA-N
- CAS Registry Number: 40595-36-6
- Chemical structure:
View 3d structure (requires JavaScript / HTML 5) - Permanent link for this species. Use this link for bookmarking this species for future reference.

Gas phase ion energetics data

Data compiled by: Sharon G. Lias, Rhoda D. Levin, and Sherif A. Kafafi
Ionization energy determinations
IE (eV) | Method | Reference |
---|---|---|
7.73 ± 0.04 | EI | Benito, Seidl, et al., 1973 |

References

Benito, Seidl, et al., 1973
Benito, I.; Seidl, H.; Bock, H.,
Efectos electronicos y estericos de sustituyentes alquilicos y silicicos sobre el sistema electronico π del estireno,
Rev. Fac. Cienc. Univ. Oviedo, 1973, 14, 95. [all data]