Cyclobutaphosphane, tetrakis(trifluoromethyl)-

Phase change data

Data compiled by: William E. Acree, Jr., James S. Chickos

Enthalpy of vaporization

ΔvapH (kcal/mol) Temperature (K) Method Reference Comment
10.3328.A,SGStephenson and Malanowski, 1987Based on data from 313. - 375. K. See also Mahler and Burg, 1958.

Enthalpy of sublimation

ΔsubH (kcal/mol) Temperature (K) Method Reference Comment
15.6307.A,SGStephenson and Malanowski, 1987Based on data from 292. - 339. K. See also Mahler and Burg, 1958.

Gas phase ion energetics data

Data compiled as indicated in comments:
LL - Sharon G. Lias and Joel F. Liebman
LLK - Sharon G. Lias, Rhoda D. Levin, and Sherif A. Kafafi

Ionization energy determinations

IE (eV) Method Reference Comment
9.5PEElbel, Egsgaard, et al., 1988LL
10.12PEElbel, Egsgaard, et al., 1988Vertical value; LL
10.18PECowley, Dewar, et al., 1978Vertical value; LLK
10.18PECowley, Dewar, et al., 1974Vertical value; LLK

References

Stephenson and Malanowski, 1987
Stephenson, Richard M.; Malanowski, Stanislaw, Handbook of the Thermodynamics of Organic Compounds, 1987, https://doi.org/10.1007/978-94-009-3173-2 . [all data]

Mahler and Burg, 1958
Mahler, Walter; Burg, Anton B., The Cyclopolyphosphines (CF 3 P) 4 and (CF 3 P) 5 , and Related Chemistry 1, J. Am. Chem. Soc., 1958, 80, 23, 6161-6167, https://doi.org/10.1021/ja01556a004 . [all data]

Elbel, Egsgaard, et al., 1988
Elbel, S.; Egsgaard, H.; Carlsen, L., Ionization energies and thermal fragmentation patterns of gaseous cyclopolyarsanes and phosphanes En, Rn(E = As or P;R = Me, Bu, or CF3; n = 3-5): A joint temperature-variable field ionization mass spectrometric and ultraviolet photoelectron spectroscopic study, J. Chem. Soc. Dalton Trans., 1988, 195. [all data]

Cowley, Dewar, et al., 1978
Cowley, A.H.; Dewar, M.J.S.; Lattman, M.; Mills, J.L.; McKee, M., An ultraviolet photoelectron spectroscopic molecular orbital study of some cyclopolyphosphines, J. Am. Chem. Soc., 1978, 100, 3349. [all data]

Cowley, Dewar, et al., 1974
Cowley, A.H.; Dewar, M.J.S.; Goodman, D.W.; Padolina, M.C., A photoelectron spectroscopic study of polyphosphines. The question of pπ:dπ bonding, J. Am. Chem. Soc., 1974, 96, 3666. [all data]