Butane, 1,1,1,2,2,3,3-heptafluoro-4-iodo-
- Formula: C4H2F7I
- Molecular weight: 309.9520
- IUPAC Standard InChIKey: AFHPVXVEXINDFS-UHFFFAOYSA-N
- CAS Registry Number: 374-98-1
- Chemical structure:
View 3d structure (requires JavaScript / HTML 5) - Other names: Heptafluorobutyl iodide; 2,2,3,3,4,4,4-Heptafluoro-1-iodobutane; 1H,1H-Heptafluoro-1-iodobutane; 1H,1H-Heptafluorobutyl iodide; 1-Iodo-1H,1H-perfluorobutane; 1,1,1,2,2,3,3-heptafluoro-4-iodobutane

Phase change data

Data compiled by: Robert L. Brown and Stephen E. Stein
Reduced pressure boiling point
Tboil (K) | Pressure (bar) | Reference |
---|---|---|
364. to 364.6 | 0.987 | PCR Inc., 1990 |

Gas phase ion energetics data

Data compiled by: Henry M. Rosenstock, Keith Draxl, Bruce W. Steiner, and John T. Herron
Ionization energy determinations
IE (eV) | Method | Reference |
---|---|---|
9.96 ± 0.02 | PI | Watanabe, Nakayama, et al., 1962 |

References

PCR Inc., 1990
PCR Inc.,
Research Chemicals Catalog 1990-1991, PCR Inc., Gainesville, FL, 1990, 1. [all data]
Watanabe, Nakayama, et al., 1962
Watanabe, K.; Nakayama, T.; Mottl, J.,
Ionization potentials of some molecules,
J. Quant. Spectry. Radiative Transfer, 1962, 2, 369. [all data]