1,3-Diphenylpropene
- Formula: C15H14
- Molecular weight: 194.2717
- IUPAC Standard InChIKey: AIMDYNJRXHEXEL-KPKJPENVSA-N
- CAS Registry Number: 3412-44-0
- Chemical structure:
View 3d structure (requires JavaScript / HTML 5) - Stereoisomers:

Gas phase ion energetics data

Data compiled by: Henry M. Rosenstock, Keith Draxl, Bruce W. Steiner, and John T. Herron
Ionization energy determinations
IE (eV) | Method | Reference |
---|---|---|
8.30 | EI | Johnstone and Millard, 1966 |
Appearance energy determinations
Ion | AE (eV) | Other Products | Method | Reference | Comment |
---|---|---|---|---|---|
C13H9+ | 13.75 | C2H5 | EI | Johnstone and Millard, 1966 | |
C13H11+ | 12.40 | C2H3 | EI | Johnstone and Millard, 1966 | |
C14H10+ | 15.05 | ? | EI | Johnstone and Millard, 1966 | |
C14H11+ | 11.95 | CH3 | EI | Johnstone and Millard, 1966 | |
C15H13+ | 11.65 | H | EI | Johnstone and Millard, 1966 |

References

Johnstone and Millard, 1966
Johnstone, R.A.W.; Millard, B.J.,
Some novel eliminations of neutral fragments from ions in mass spectrometry. Part III. Fragmentation of the 1,3-diphenylpropene ion-radical,
J. Chem. Soc., 1966, (C), 1955. [all data]