1,2,4,5-Hexatetraene
- Formula: C6H6
- Molecular weight: 78.1118
- IUPAC Standard InChIKey: ROAKNVNVSBKPLL-UHFFFAOYSA-N
- CAS Registry Number: 29776-96-3
- Chemical structure:
View 3d structure (requires JavaScript / HTML 5) - Permanent link for this species. Use this link for bookmarking this species for future reference.

Gas phase ion energetics data

Data compiled as indicated in comments:
LLK - Sharon G. Lias, Rhoda D. Levin, and Sherif A. Kafafi
Ionization energy determinations
IE (eV) | Method | Reference | Comment |
---|---|---|---|
8.58 ± 0.02 | PE | Bieri, Burger, et al., 1977 | LLK |
8.53 | PE | Bischof, Gleiter, et al., 1975 | Vertical value; LLK |

References

Bieri, Burger, et al., 1977
Bieri, G.; Burger, F.; Heilbronner, E.; Maier, J.P.,
Valence ionization enrgies of hydrocarbons,
Helv. Chim. Acta, 1977, 60, 2213. [all data]
Bischof, Gleiter, et al., 1975
Bischof, P.; Gleiter, R.; Hopf, H.; Lenich, F.T.,
Photoelectron spectra of open chain C6H6 isomers,
J. Am. Chem. Soc., 1975, 97, 5467. [all data]