Oxazole
- Formula: C3H3NO
- Molecular weight: 69.0620
- IUPAC Standard InChIKey: ZCQWOFVYLHDMMC-UHFFFAOYSA-N
- CAS Registry Number: 288-42-6
- Chemical structure:
View 3d structure (requires JavaScript / HTML 5) - Other names: 1,3-Oxazole

Gas phase thermochemistry data

Data compiled by: Hussein Y. Afeefy, Joel F. Liebman, and Stephen E. Stein
Quantity | Value | Units | Method | Reference | Comment |
---|---|---|---|---|---|
ΔfH°gas | -15.5 ± 0.54 | kJ/mol | Ccb | McCormick and Hamilton, 1978 | see McCormick, 1977 |

Condensed phase thermochemistry data

Data compiled by: Hussein Y. Afeefy, Joel F. Liebman, and Stephen E. Stein
Quantity | Value | Units | Method | Reference | Comment |
---|---|---|---|---|---|
ΔfH°liquid | -48.03 ± 0.54 | kJ/mol | Ccb | McCormick and Hamilton, 1978 | see McCormick, 1977 |
Quantity | Value | Units | Method | Reference | Comment |
ΔcH°liquid | -1561.3 ± 0.50 | kJ/mol | Ccb | McCormick and Hamilton, 1978 | see McCormick, 1977 |

Phase change data

Data compiled as indicated in comments:
BS - Robert L. Brown and Stephen E. Stein
TRC - Thermodynamics Research Center, NIST Boulder Laboratories, Chris Muzny director
ALS - Hussein Y. Afeefy, Joel F. Liebman, and Stephen E. Stein
AC - William E. Acree, Jr., James S. Chickos
Quantity | Value | Units | Method | Reference | Comment |
---|---|---|---|---|---|
Tboil | 342.7 | K | N/A | Weast and Grasselli, 1989 | BS |
Tboil | 342.71 | K | N/A | Soulie, Bares, et al., 1975 | Uncertainty assigned by TRC = 0.2 K; calculated from Antoine eq. based on obs. vapor pressures; TRC |
Quantity | Value | Units | Method | Reference | Comment |
ΔvapH° | 32.5 ± 0.1 | kJ/mol | C | McCormick and Hamilton, 1978 | see McCormick, 1977; ALS |
ΔvapH° | 32.5 ± 0.1 | kJ/mol | C | McCormick and Hamilton, 1978 | AC |
Enthalpy of vaporization
ΔvapH (kJ/mol) | Temperature (K) | Method | Reference | Comment |
---|---|---|---|---|
34.6 | 308. | A | Stephenson and Malanowski, 1987 | Based on data from 293. to 344. K.; AC |

Gas phase ion energetics data

Data evaluated as indicated in comments:
HL - Edward P. Hunter and Sharon G. Lias
Data compiled as indicated in comments:
LBLHLM - Sharon G. Lias, John E. Bartmess, Joel F. Liebman, John L. Holmes, Rhoda D. Levin, and W. Gary Mallard
LLK - Sharon G. Lias, Rhoda D. Levin, and Sherif A. Kafafi
Quantity | Value | Units | Method | Reference | Comment |
---|---|---|---|---|---|
Proton affinity (review) | 876.4 | kJ/mol | N/A | Hunter and Lias, 1998 | HL |
Quantity | Value | Units | Method | Reference | Comment |
Gas basicity | 844.5 | kJ/mol | N/A | Hunter and Lias, 1998 | HL |
Ionization energy determinations
IE (eV) | Method | Reference | Comment |
---|---|---|---|
9.9 | PE | Kobayashi, Kubota, et al., 1982 | LBLHLM |
9.6 | EI | Audier, Fetizon, et al., 1976 | LLK |
10.15 | PE | Kobayashi, Kubota, et al., 1982 | Vertical value; LBLHLM |
Appearance energy determinations
Ion | AE (eV) | Other Products | Method | Reference | Comment |
---|---|---|---|---|---|
C2H2N+ | 14.1 | HCO | EI | Audier, Fetizon, et al., 1976 | LLK |
C2H2O+ | 12.2 ± 0.6 | HCN | EI | Audier, Fetizon, et al., 1976 | LLK |
C2H3N+ | 11.0 | CO | EI | Audier, Fetizon, et al., 1976 | LLK |
C3H2NO+ | 12.7 | H | EI | Audier, Fetizon, et al., 1976 | LLK |

Kovats' RI, non-polar column, isothermal

Column type | Active phase | Temperature (C) | I | Reference | Comment |
---|---|---|---|---|---|
Capillary | OV-101 | 110. | 580. | Zhuravleva, 2000 | 50. m/0.3 mm/0.4 μm, He |
Capillary | OV-101 | 110. | 538. | Golovnya, Kuz'menko, et al., 1999 | 50. m/0.3 mm/0.4 μm, He |
Capillary | OV-101 | 110. | 580. | Zhuravleva, Shenderyuk, et al., 1990 | 50. m/0.30 mm/0.40 μm, He |
Capillary | OV-101 | 110. | 580. | Golovnya, Shenderyuk, et al., 1989 | 40. m/0.28 mm/0.40 μm, He |

Kovats' RI, polar column, isothermal

Column type | Active phase | Temperature (C) | I | Reference | Comment |
---|---|---|---|---|---|
Capillary | PEG-40M | 110. | 1019. | Zhuravleva, Shenderyuk, et al., 1990 | 50. m/0.30 mm/0.40 μm, He |
Capillary | PEG-40M | 110. | 1019. | Golovnya, Shenderyuk, et al., 1989 | 47. m/0.30 mm/0.40 μm, He |

Lee's RI, non-polar column, temperature ramp

Column type | Active phase | I | Reference | Comment |
---|---|---|---|---|
Capillary | HP-5 | 97.3 | Wang, Hou, et al., 2007 | 30. m/0.30 mm/0.25 μm, Helium, 50. C @ 5. min, 5. K/min, 200. C @ 15. min |

References

McCormick and Hamilton, 1978
McCormick, D.G.; Hamilton, W.S.,
The enthalpies of combustion and formation of oxazole and isoxazole,
J. Chem. Thermodyn., 1978, 10, 275-278. [all data]
McCormick, 1977
McCormick, D.G.,
The resonance energies of oxazole and isoxazole determined from the enthalpies of combustion and formation (Order No. 7801771),
Diss. Abstr. Int. B, 1977, 38, 4271. [all data]
Weast and Grasselli, 1989
CRC Handbook of Data on Organic Compounds, 2nd Editon, Weast,R.C and Grasselli, J.G., ed(s)., CRC Press, Inc., Boca Raton, FL, 1989, 1. [all data]
Soulie, Bares, et al., 1975
Soulie, M.A.; Bares, D.; Metzger, J.,
Vapor Pressures of Some Azaaromatic Compounds,
C. R. Seances Acad. Sci., Ser. C, 1975, 281, 341. [all data]
Stephenson and Malanowski, 1987
Stephenson, Richard M.; Malanowski, Stanislaw,
Handbook of the Thermodynamics of Organic Compounds, 1987, https://doi.org/10.1007/978-94-009-3173-2
. [all data]
Hunter and Lias, 1998
Hunter, E.P.; Lias, S.G.,
Evaluated Gas Phase Basicities and Proton Affinities of Molecules: An Update,
J. Phys. Chem. Ref. Data, 1998, 27, 3, 413-656, https://doi.org/10.1063/1.556018
. [all data]
Kobayashi, Kubota, et al., 1982
Kobayashi, T.; Kubota, T.; Ezumi, K.; Utsunomiya, C.,
Photoelectron angular distribution study of some isoxazoles combined with perturbation theoretic approach,
Bull. Chem. Soc. Jpn., 1982, 55, 3915. [all data]
Audier, Fetizon, et al., 1976
Audier, H.-E.; Fetizon, M.; Henry, Y.; Prange, T.,
Mecanismes de fragmentation de l'oxazole,
Org. Mass Spectrom., 1976, 11, 1047. [all data]
Zhuravleva, 2000
Zhuravleva, I.L.,
Evaluation of the polarity and boiling points of nitrogen-containing heterocyclic compounds by gas chromatography,
Russ. Chem. Bull. (Engl. Transl.), 2000, 49, 2, 325-328, https://doi.org/10.1007/BF02494682
. [all data]
Golovnya, Kuz'menko, et al., 1999
Golovnya, R.V.; Kuz'menko, T.E.; Zhuravleva, I.L.,
Gas chromatographic indicator of the ability of five- and six-membered heterocyclic nitrogen-containing compounds for self-association in pure liquids,
Russ. Chem. Bull. (Engl. Transl.), 1999, 48, 4, 726-729, https://doi.org/10.1007/BF02496256
. [all data]
Zhuravleva, Shenderyuk, et al., 1990
Zhuravleva, I.L.; Shenderyuk, V.V.; Yakush, E.V.; Golovnya, R.V.,
Calculation of retention indexes of alkyloxazoles and alkylthiazoles in capillary chromatography,
Bull. Acad. Sci. USSR, Div. Chem. Sci. (Engl. Transl.), 1990, 6, 6, 1204-1210, https://doi.org/10.1007/BF00962384
. [all data]
Golovnya, Shenderyuk, et al., 1989
Golovnya, R.V.; Shenderyuk, V.V.; Zhuravleva, I.L.; Yakush, E.V.,
Use of a principle of non-additivity of sorption energies for calculation of retention indices of alkyloxazoles in capillary chromatography,
Zh. Anal. Khim., 1989, 44, 2037-2042. [all data]
Wang, Hou, et al., 2007
Wang, G.; Hou, Z.; Sun, Y.; Liu, Y.; Xie, B.; Liu, S.,
Investigation of pyrolysis behavior of fenoxycarb using PY-GC-MS assisted with chemometric methods,
Chem. Anal., 2007, 52, 141-156. [all data]