Hexacene
- Formula: C26H16
- Molecular weight: 328.4052
- IUPAC Standard InChIKey: QSQIGGCOCHABAP-UHFFFAOYSA-N
- CAS Registry Number: 258-31-1
- Chemical structure:
View 3d structure (requires JavaScript / HTML 5) - Permanent link for this species. Use this link for bookmarking this species for future reference.

Gas phase ion energetics data

Data compiled by: Sharon G. Lias, Rhoda D. Levin, and Sherif A. Kafafi
Ionization energy determinations
IE (eV) | Method | Reference | Comment |
---|---|---|---|
6.36 | PE | Clar, Robertson, et al., 1981 | |
6.44 | PE | Clar and Schmidt, 1975 | |
6.44 ± 0.04 | PE | Boschi, Clar, et al., 1974 | |
6.36 ± 0.02 | PE | Schmidt, 1977 | Vertical value |

References

Clar, Robertson, et al., 1981
Clar, E.; Robertson, J.M.; Schlogl, R.; Schmidt, W.,
Photoelectron spectra of polynuclear aromatics. 6. Application to structural elucidation: 'Circumanthracene',
J. Am. Chem. Soc., 1981, 103, 1320. [all data]
Clar and Schmidt, 1975
Clar, E.; Schmidt, W.,
Correlations btween photoelectron and ultraviolet absorption spectra of polycyclic hydrocarbons and the number of aromatic sextets,
Tetrahedron, 1975, 31, 2263. [all data]
Boschi, Clar, et al., 1974
Boschi, R.; Clar, E.; Schmidt, W.,
Photoelectron spectra of polynuclear aromatics. III. The effect of nonplanarity in sterically overcrowded aromatic hydrocarbons,
J. Chem. Phys., 1974, 60, 4406. [all data]
Schmidt, 1977
Schmidt, W.,
Photoelectron spectra of polynuclear aromatics. V. Correlations with ultraviolet absorption spectra in the catacondensed series,
J. Chem. Phys., 1977, 66, 828. [all data]