Thiourea, trimethyl-
- Formula: C4H10N2S
- Molecular weight: 118.201
- IUPAC Standard InChIKey: JAEZSIYNWDWMMN-UHFFFAOYSA-N
- CAS Registry Number: 2489-77-2
- Chemical structure:
View 3d structure (requires JavaScript / HTML 5) - Other names: Urea, 1,1,3-trimethyl-2-thio-; N,N,N'-Trimethylthiourea; Thiate E; Trimethylthiourea; 1,1,3-Trimethylthiourea; 1,3,3-Trimethylthiourea; NCI-C02186; 1,1,3-Trimethyl-2-thiourea; NSC 153385; Thiourea, N,N,N'-trimethyl-; trimethyl-2-thiourea

Gas phase ion energetics data

Data compiled as indicated in comments:
RDSH - Henry M. Rosenstock, Keith Draxl, Bruce W. Steiner, and John T. Herron
LLK - Sharon G. Lias, Rhoda D. Levin, and Sherif A. Kafafi
Ionization energy determinations
IE (eV) | Method | Reference | Comment |
---|---|---|---|
7.93 ± 0.05 | EI | Baldwin, Maccoll, et al., Ind. 1966 | RDSH |
Appearance energy determinations
Ion | AE (eV) | Other Products | Method | Reference | Comment |
---|---|---|---|---|---|
CH4N+ | 11.60 | ? | EI | Loudon and Webb, 1977 | LLK |
C2H4NS+ | 11.25 | ? | EI | Loudon and Webb, 1977 | LLK |
C2H6N+ | 10.85 | ? | EI | Loudon and Webb, 1977 | LLK |

References

Baldwin, Maccoll, et al., Ind. 1966
Baldwin, M.; Maccoll, A.; Kirkien-Konasiewicz, A.; Saville, B.,
Ionisation potentials of the N-methylated thioureas,
Chem., Ind. 1966, 286. [all data]
Loudon and Webb, 1977
Loudon, A.G.; Webb, K.S.,
The nature of the [C2H6N]+ and [CH4N]+ ions formed by electron impact on methylated formamides, acetamides, ureas, thioureas and hexamethylphosphoramide,
Org. Mass Spectrom., 1977, 12, 283. [all data]