Chloromethylmethyl sulfide
- Formula: C2H5ClS
- Molecular weight: 96.579
- IUPAC Standard InChIKey: JWMLCCRPDOIBAV-UHFFFAOYSA-N
- CAS Registry Number: 2373-51-5
- Chemical structure:
View 3d structure (requires JavaScript / HTML 5) - Other names: CH3SCH2Cl; Methane, chloro(methylthio)-; α-Chlorodimethyl sulfide; Chlorodimethyl thioether; Chloromethyl methyl thioether; Methylthiomethyl chloride; Monochlorodimethyl sulfide; Sulfide, chloromethyl methyl; Chlorodimethyl sulfide; Clorodimetilsolfuro; Chloro(methylthio)methane; NSC 63205; chloromethyl methyl sulphide

Phase change data

Data compiled by: Robert L. Brown and Stephen E. Stein
Quantity | Value | Units | Method | Reference | Comment |
---|---|---|---|---|---|
Tboil | 378.2 | K | N/A | Weast and Grasselli, 1989 |

Gas phase ion energetics data

Data compiled as indicated in comments:
LLK - Sharon G. Lias, Rhoda D. Levin, and Sherif A. Kafafi
Ionization energy determinations
IE (eV) | Method | Reference | Comment |
---|---|---|---|
9.17 | PE | Weiner and Lattman, 1978 | Vertical value; LLK |

Vibrational and/or electronic energy levels

Data compiled by: Marilyn E. Jacox
State: ?
Energy (cm-1) |
Med. | Transition | λmin (nm) |
λmax (nm) |
References | ||
---|---|---|---|---|---|---|---|
Tx = 35500 | Ar | Maier, Flogel, et al., 1991 | |||||
State: X
Vib. sym. |
No. | Approximate type of mode |
cm-1 | Med. | Method | References | |
---|---|---|---|---|---|---|---|
3026.8 | w | Ar | IR | Maier, Flogel, et al., 1991 | |||
1423.3 | m | Ar | IR | Maier, Flogel, et al., 1991 | |||
1415.5 | m | Ar | IR | Maier, Flogel, et al., 1991 | |||
1386.1 | s | Ar | IR | Maier, Flogel, et al., 1991 | |||
1039.0 | s | Ar | IR | Maier, Flogel, et al., 1991 | |||
993.7 | m | Ar | IR | Maier, Flogel, et al., 1991 | |||
965.2 | m | Ar | IR | Maier, Flogel, et al., 1991 | |||
747.8 | vs | Ar | IR | Maier, Flogel, et al., 1991 | |||
Additional references: Jacox, 1994, page 418

Normal alkane RI, non-polar column, temperature ramp

Column type | Active phase | I | Reference | Comment |
---|---|---|---|---|
Capillary | OV-101 | 713. | Zenkevich, 2005 | 25. m/0.20 mm/0.10 μm, N2/He, 6. K/min; Tstart: 50. C; Tend: 250. C |

References

Weast and Grasselli, 1989
CRC Handbook of Data on Organic Compounds, 2nd Editon, Weast,R.C and Grasselli, J.G., ed(s)., CRC Press, Inc., Boca Raton, FL, 1989, 1. [all data]
Weiner and Lattman, 1978
Weiner, M.A.; Lattman, M.,
Ultraviolet photoelectron spectra of some Cr(CO)5L complexes containing organosulfide and organophosphine ligands,
Inorg. Chem., 1978, 17, 1084. [all data]
Maier, Flogel, et al., 1991
Maier, G.; Flogel, U.; Reisenauer, H.P.; Hess, B.A., Jr.; Schaad, L.J.,
Photoisomerisierung von Halogendimethylsulfiden,
Chem. Ber., 1991, 124, 11, 2603, https://doi.org/10.1002/cber.19911241133
. [all data]
Jacox, 1994
Jacox, M.E.,
Vibrational and electronic energy levels of polyatomic transient molecules, American Chemical Society, Washington, DC, 1994, 464. [all data]
Zenkevich, 2005
Zenkevich, I.G.,
Experimentally measured retention indices., 2005. [all data]