Sulfur dimer
- Formula: S2
- Molecular weight: 64.130
- IUPAC Standard InChIKey: MAHNFPMIPQKPPI-UHFFFAOYSA-N
- CAS Registry Number: 23550-45-0
- Chemical structure:
View 3d structure (requires JavaScript / HTML 5) - Permanent link for this species. Use this link for bookmarking this species for future reference.

Gas phase thermochemistry data

Quantity | Value | Units | Method | Reference | Comment |
---|---|---|---|---|---|
ΔfH°gas | 128.60 ± 0.30 | kJ/mol | Review | Cox, Wagman, et al., 1984 | CODATA Review value |
ΔfH°gas | 128.60 | kJ/mol | Review | Chase, 1998 | Data last reviewed in September, 1977 |
Quantity | Value | Units | Method | Reference | Comment |
S°gas,1 bar | 228.167 ± 0.010 | J/mol*K | Review | Cox, Wagman, et al., 1984 | CODATA Review value |
S°gas,1 bar | 228.19 | J/mol*K | Review | Chase, 1998 | Data last reviewed in September, 1977 |
Gas Phase Heat Capacity (Shomate Equation)
Cp° = A + B*t + C*t2 + D*t3 +
E/t2
H° − H°298.15= A*t + B*t2/2 +
C*t3/3 + D*t4/4 − E/t + F − H
S° = A*ln(t) + B*t + C*t2/2 + D*t3/3 −
E/(2*t2) + G
Cp = heat capacity (J/mol*K)
H° = standard enthalpy (kJ/mol)
S° = standard entropy (J/mol*K)
t = temperature (K) / 1000.
View plot Requires a JavaScript / HTML 5 canvas capable browser.
Temperature (K) | 298. to 6000. |
---|---|
A | 33.51313 |
B | 5.065360 |
C | -1.059670 |
D | 0.089905 |
E | -0.211911 |
F | 117.6855 |
G | 266.0919 |
H | 128.6003 |
Reference | Chase, 1998 |
Comment | Data last reviewed in September, 1977 |

Reaction thermochemistry data

Data compiled as indicated in comments:
B - John E. Bartmess
RCD - Robert C. Dunbar
Individual Reactions
By formula: (HS2- • 4294967295S2) + S2 = HS2-
Quantity | Value | Units | Method | Reference | Comment |
---|---|---|---|---|---|
ΔrH° | 341. ± 15. | kJ/mol | N/A | Entfellner and Boesl, 2009 | gas phase; B |
ΔrH° | 195. ± 15. | kJ/mol | Ther | Moran and Ellison, 1988 | gas phase; B |
By formula: (OS2- • 4294967295S2) + S2 = OS2-
Quantity | Value | Units | Method | Reference | Comment |
---|---|---|---|---|---|
ΔrH° | 474.0 ± 1.6 | kJ/mol | N/A | Nimlos and Ellison, 1986 | gas phase; B |
By formula: (V+ • S2) + S2 = (V+ • 2S2)
Quantity | Value | Units | Method | Reference | Comment |
---|---|---|---|---|---|
ΔrH° | 286. ± 18. | kJ/mol | CIDT | Schroeder, Kretzschmar, et al., 2003 | RCD |
By formula: (Mo+ • S2) + S2 = (Mo+ • 2S2)
Quantity | Value | Units | Method | Reference | Comment |
---|---|---|---|---|---|
ΔrH° | 300. ± 13. | kJ/mol | CIDT | Schroeder, Kretzschmar, et al., 2003 | RCD |
By formula: V+ + S2 = (V+ • S2)
Quantity | Value | Units | Method | Reference | Comment |
---|---|---|---|---|---|
ΔrH° | 313. ± 13. | kJ/mol | CIDT | Schroeder, Kretzschmar, et al., 2003 | RCD |
By formula: Mo+ + S2 = (Mo+ • S2)
Quantity | Value | Units | Method | Reference | Comment |
---|---|---|---|---|---|
ΔrH° | 329. ± 10. | kJ/mol | CIDT | Schroeder, Kretzschmar, et al., 2003 | RCD |

Gas phase ion energetics data

Data evaluated as indicated in comments:
L - Sharon G. Lias
Data compiled as indicated in comments:
B - John E. Bartmess
LL - Sharon G. Lias and Joel F. Liebman
LBLHLM - Sharon G. Lias, John E. Bartmess, Joel F. Liebman, John L. Holmes, Rhoda D. Levin, and W. Gary Mallard
LLK - Sharon G. Lias, Rhoda D. Levin, and Sherif A. Kafafi
RDSH - Henry M. Rosenstock, Keith Draxl, Bruce W. Steiner, and John T. Herron
Quantity | Value | Units | Method | Reference | Comment |
---|---|---|---|---|---|
IE (evaluated) | 9.356 ± 0.002 | eV | N/A | N/A | L |
Electron affinity determinations
EA (eV) | Method | Reference | Comment |
---|---|---|---|
1.670 ± 0.015 | LPES | Moran and Ellison, 1988 | B |
1.663 ± 0.040 | LPES | Celotta, Bennett, et al., 1974 | B |
1.565 ± 0.050 | LPD | Hunsicker, Jones, et al., 1995 | B |
>0.86 ± 0.10 | R-A | Dillard and Franklin, 1968 | S- + COS -> S2- + CO. Also S2- + COS -> S3- + CO, etc. to n=6; B |
>2.50 ± 0.80 | EIAE | Thynne, 1972 | From CS2; B |
Ionization energy determinations
IE (eV) | Method | Reference | Comment |
---|---|---|---|
9.4 | PE | Bender, Carnovale, et al., 1988 | LL |
9.356 ± 0.002 | PI | Liao and Ng, 1986 | LBLHLM |
9.6 ± 0.2 | EI | Rosinger, Grade, et al., 1983 | LBLHLM |
9.5 ± 0.2 | EI | Grade, Wienecke, et al., 1983 | LBLHLM |
9.5 ± 0.3 | EI | Lau, Brittain, et al., 1982 | LBLHLM |
9.38 ± 0.03 | DER | Coppens, Reynaert, et al., 1979 | LLK |
9.36 ± 0.02 | EI | Tal'roze, Butkovskaya, et al., 1978 | LLK |
9.8 ± 0.3 | EI | Smoes, Drowart, et al., 1977 | LLK |
10.1 ± 0.3 | EI | Piacente, Bardi, et al., 1976 | LLK |
9.4 ± 0.1 | EI | Hildenbrand, 1975 | LLK |
9.38 ± 0.01 | PE | Golob, Jonathan, et al., 1975 | LLK |
9.30 | PE | Berkowitz, 1975 | LLK |
9.8 ± 0.5 | EI | Muenow and Margrave, 1972 | LLK |
9.42 ± 0.10 | EI | Hildenbrand, 1972 | LLK |
9.40 ± 0.05 | S | Donovan, Husain, et al., 1970 | RDSH |
9.32 | S | Barrow, duParcq, et al., 1969 | RDSH |
9.36 ± 0.02 | PI | Berkowitz and Lifshitz, 1968 | RDSH |
9.55 | PE | Wu and Fehlner, 1976 | Vertical value; LLK |
9.56 | PE | Berkowitz, 1975 | Vertical value; LLK |
Appearance energy determinations
Ion | AE (eV) | Other Products | Method | Reference | Comment |
---|---|---|---|---|---|
S+ | 14.732 ± 0.005 | S | PI | Liao and Ng, 1986 | LBLHLM |
S+ | 13.5 ± 0.5 | S | EI | Piacente, Bardi, et al., 1976 | LLK |
S+ | 14.74 ± 0.01 | S | PI | Berkowitz and Chupka, 1969 | RDSH |
Anion protonation reactions
Quantity | Value | Units | Method | Reference | Comment |
---|---|---|---|---|---|
ΔrH° | 1380. ± 15. | kJ/mol | D-EA | Moran and Ellison, 1988 | gas phase; B |
Quantity | Value | Units | Method | Reference | Comment |
ΔrG° | >1441.8 | kJ/mol | IMRB | Goodings, Bohme, et al., 1986 | gas phase; S- deprotonates H2S, Sn- for n≥2, does not.; B |

Ion clustering data

Data compiled as indicated in comments:
B - John E. Bartmess
RCD - Robert C. Dunbar
Clustering reactions
By formula: (HS2- • 4294967295S2) + S2 = HS2-
Quantity | Value | Units | Method | Reference | Comment |
---|---|---|---|---|---|
ΔrH° | 341. ± 15. | kJ/mol | N/A | Entfellner and Boesl, 2009 | gas phase; B |
ΔrH° | 195. ± 15. | kJ/mol | Ther | Moran and Ellison, 1988 | gas phase; B |
By formula: Mo+ + S2 = (Mo+ • S2)
Quantity | Value | Units | Method | Reference | Comment |
---|---|---|---|---|---|
ΔrH° | 329. ± 10. | kJ/mol | CIDT | Schroeder, Kretzschmar, et al., 2003 | RCD |
By formula: (Mo+ • S2) + S2 = (Mo+ • 2S2)
Quantity | Value | Units | Method | Reference | Comment |
---|---|---|---|---|---|
ΔrH° | 300. ± 13. | kJ/mol | CIDT | Schroeder, Kretzschmar, et al., 2003 | RCD |
By formula: (OS2- • 4294967295S2) + S2 = OS2-
Quantity | Value | Units | Method | Reference | Comment |
---|---|---|---|---|---|
ΔrH° | 474.0 ± 1.6 | kJ/mol | N/A | Nimlos and Ellison, 1986 | gas phase; B |
By formula: V+ + S2 = (V+ • S2)
Quantity | Value | Units | Method | Reference | Comment |
---|---|---|---|---|---|
ΔrH° | 313. ± 13. | kJ/mol | CIDT | Schroeder, Kretzschmar, et al., 2003 | RCD |
By formula: (V+ • S2) + S2 = (V+ • 2S2)
Quantity | Value | Units | Method | Reference | Comment |
---|---|---|---|---|---|
ΔrH° | 286. ± 18. | kJ/mol | CIDT | Schroeder, Kretzschmar, et al., 2003 | RCD |

Constants of diatomic molecules

Data compiled by: Klaus P. Huber and Gerhard H. Herzberg

Data collected through July, 1977

Symbols used in the table of constants
SymbolMeaning
State electronic state and / or symmetry symbol
Te minimum electronic energy (cm-1)
ωe vibrational constant – first term (cm-1)
ωexe vibrational constant – second term (cm-1)
ωeye vibrational constant – third term (cm-1)
Be rotational constant in equilibrium position (cm-1)
αe rotational constant – first term (cm-1)
γe rotation-vibration interaction constant (cm-1)
De centrifugal distortion constant (cm-1)
βe rotational constant – first term, centrifugal force (cm-1)
re internuclear distance (Å)
Trans. observed transition(s) corresponding to electronic state
ν00 position of 0-0 band (units noted in table)
Diatomic constants for 32S2
StateTeωeωexeωeyeBeαeγeDeβereTrans.ν00
Additional progressions and unassigned bands in the absorption spectrum 65700 - 71900 cm-1.
Mahajan, Lakshminarayana, et al., 1976
F 2 (66333) [827] 1 H         F ← X 66384 1 H
Donovan, Husain, et al., 1970; Mahajan, Lakshminarayana, et al., 1976
(66229) [827] 1 H         F ← X 66280 1 H
Donovan, Husain, et al., 1970; Mahajan, Lakshminarayana, et al., 1976
E 2 (65933) [818] 1 H         E ← X 65980 1 H
Donovan, Husain, et al., 1970; Mahajan, Lakshminarayana, et al., 1976
(65829) [818] 1 H         E ← X 65876 1 H
Donovan, Husain, et al., 1970; Mahajan, Lakshminarayana, et al., 1976
StateTeωeωexeωeyeBeαeγeDeβereTrans.ν00
j 3          j → (b) 4 V 56077.7 H
missing citation
i  [785.0] H         i → (b) 4 V 55099.3 H
missing citation
h  819.6 H 2.70        h → (b) 4 V 51461.4 H
missing citation
D 3Πu,r 58978.7 793.8 H 4.00  [0.3073]   [1.85E-7]  [1.8546] D ↔ X V 59012.50 Z
missing citation; Tanaka and Ogawa, 1962; Ricks and Barrow, 1969
58691.7 793.8 H 4.00  [0.3066]   [1.85E-7]  [1.8546] D ↔ X V 58725.47 Z
missing citation; Tanaka and Ogawa, 1962; Ricks and Barrow, 1969
58518.3 793.8 H 4.00  [0.3059]   [1.85E-7]  [1.8546] D ↔ X V 58552.05 Z
missing citation; Tanaka and Ogawa, 1962; Ricks and Barrow, 1969
StateTeωeωexeωeyeBeαeγeDeβereTrans.ν00
g 1Δu x+ 52187.7 816.0 H 2.70  [0.3210]   (2.0E-7)  [1.8125] g ↔ a 5 V 52244.66 Z
missing citation; Barrow and Du Parcq, 1968
C' (3Σu-) 6          C' → X V 56621.6 H
missing citation
C 3Σu- 55581.7 829.15 Z 3.34  0.3219 7 0.00138 -2.3E-4 [2.17E-7]  1.8100 C ↔ X V 55633.3 8 Z
Wieland, Wehrli, et al., 1934; missing citation; Tanaka and Ogawa, 1962; missing citation
f 1Δu x+ 36875.45 438.32 Z 2.70 -0.005 0.22704 9 0.00178  (2.43E-7)  2.1551 f ↔ a 10 R 36743.53 Z
Barrow and Du Parcq, 1968; Carleer and Colin, 1970
StateTeωeωexeωeyeBeαeγeDeβereTrans.ν00
B' 3Πg,i     11      B' → A V
Narasimham, 1964; Narasimham and Apparao, 1966; missing citation
z+ (14504) [533.7] 12 (Z)   [0.2441] 11     [2.078] B' → A V 13451.95 13 Z
Narasimham, 1964; Narasimham and Apparao, 1966; missing citation
z+ (14295)    [0.2435] 11      B' → A V 13320.64 13 Z
Narasimham, 1964; Narasimham and Apparao, 1966; missing citation
           B' → A' V
Meakin and Barrow, 1962; Narasimham, 1964; Narasimham and Apparao, 1966; missing citation
           B' → A' V 14144.37 Z
Meakin and Barrow, 1962; Narasimham, 1964; Narasimham and Apparao, 1966; missing citation
           B' → A' V 14318.07 Z
Meakin and Barrow, 1962; Narasimham, 1964; Narasimham and Apparao, 1966; missing citation
StateTeωeωexeωeyeBeαeγeDeβereTrans.ν00
B 3Σu- 31835 434.0 14 2.75 14  0.2239 14 15 16 0.0023 14  [2.4E-7] 14  2.170 B ↔ X 17 18 R 31689 19
Olsson, 1938; Ikenoue, 1960; Barrow and du Parcq, 1965
A 3Σu+(0u-) z+ 1078 20 482.75 Z 2.58  0.2301 0.0021    2.141
A 3Σu+(1u) z+1000.49 482.15 Z 2.56  0.2259 21 0.0014    2.161
A' 3Δu ,i
A' 3Δu,i z+ 383 488.16 Z 2.51  0.2285 0.0014    2.148
z 22 488.25 Z 2.52  0.2285 0.0015
StateTeωeωexeωeyeBeαeγeDeβereTrans.ν00
b 1Σg+ y (699.7) 23 (3.4) 23
a 1Δg x 24 702.35 Z 3.09  0.29262 0.00173  (2.01E-7)  1.8983
X 3Σg- 0 25 725.65 Z 2.844  0.29547 26 0.001570 27 -1.82E-6 [1.90E-7]  1.8892 28
Yee, Barrow, et al., 1972; Freedman and Jones, 1975
EPR and
Wayne, Davies, et al., 1974
mol. Beam rf sp.
Channappa, Pendlebury, et al., 1967

References

Cox, Wagman, et al., 1984
Cox, J.D.; Wagman, D.D.; Medvedev, V.A.,
CODATA Key Values for Thermodynamics, Hemisphere Publishing Corp., New York, 1984, 1. [all data]
Chase, 1998
Chase, M.W., Jr.,
NIST-JANAF Themochemical Tables, Fourth Edition,
J. Phys. Chem. Ref. Data, Monograph 9, 1998, 1-1951. [all data]
Entfellner and Boesl, 2009
Entfellner, M.; Boesl, U.,
Photodetachment-photoelectron spectroscopy of disulfanide: the ground and first excited electronic state of HS2 and DS2,
Phys. Chem. Chem. Phys., 2009, 11, 15, 2657-2662, https://doi.org/10.1039/b820174a
. [all data]
Moran and Ellison, 1988
Moran, S.; Ellison, G.B.,
Photoelectron Spectroscopy of Sulfur Ions,
J. Phys. Chem., 1988, 92, 7, 1794, https://doi.org/10.1021/j100318a021
. [all data]
Nimlos and Ellison, 1986
Nimlos, M.R.; Ellison, G.B.,
Photoelectron spectroscopy of SO2-, S3-, and S2O-,
J. Phys. Chem., 1986, 90, 2574. [all data]
Schroeder, Kretzschmar, et al., 2003
Schroeder, D.; Kretzschmar, I.; Schwarz; Armentrout, P.B.,
Structure, Thermochemistry, and Reactivityof MSn+ Cations (M=V,Mo; n=1-3) in the Gas Phase,
Int. J. Mass Spectrom., 2003, 228, 2-3, 439, https://doi.org/10.1016/S1387-3806(03)00137-4
. [all data]
Celotta, Bennett, et al., 1974
Celotta, R.S.; Bennett, R.A.; Hall, J.L.,
Laser Photodetachment Determination of the Electron Affinities of OH, NH2, NH, SO2, and S2,
J. Chem. Phys., 1974, 60, 5, 1740, https://doi.org/10.1063/1.1681268
. [all data]
Hunsicker, Jones, et al., 1995
Hunsicker, S.; Jones, R.O.; Gantefor, G.,
Rings and chains in sulfur cluster anions S- to S-9(-): Theory (simulated annealing) and experiment (photoelectron detachment),
J. Chem. Phys., 1995, 102, 15, 5917, https://doi.org/10.1063/1.469326
. [all data]
Dillard and Franklin, 1968
Dillard, J.G.; Franklin, J.L.,
Ion-Molecule Reactions of Negative Ions. I. Negative Ions of Sulfur,
J. Chem. Phys., 1968, 48, 5, 2349, https://doi.org/10.1063/1.1669435
. [all data]
Thynne, 1972
Thynne, J.C.J.,
Negative Ion Studies with a Time-of-Flight Mass Spectrometer.,
Dyn. Mass Spectrom., 1972, 3, 67. [all data]
Bender, Carnovale, et al., 1988
Bender, H.; Carnovale, F.; Peel, J.B.; Wentrup, C.,
Dinitrogen sulfide, N2S, revealed by photoelectron spectroscopy,
J. Am. Chem. Soc., 1988, 110, 3458. [all data]
Liao and Ng, 1986
Liao, C.; Ng, C.,
Molecular beam photoionization study of S2,
J. Chem. Phys., 1986, 84, 788. [all data]
Rosinger, Grade, et al., 1983
Rosinger, W.; Grade, M.; Hirschwald, W.,
Detection of ion states of S2 to S8 by electron impact,
Int. J. Mass Spectrom. Ion Processes, 1983, 47, 239. [all data]
Grade, Wienecke, et al., 1983
Grade, M.; Wienecke, J.; Rosinger, W.; Hirschwald, W.,
Electron impact investigation of the molecules SeS(g) and TeSe(g) under high-temperature equilibrium conditions,
Ber. Bunsen-Ges. Phys. Chem., 1983, 87, 355. [all data]
Lau, Brittain, et al., 1982
Lau, K.H.; Brittain, R.D.; Hildenbrand, D.L.,
Vaporization of As2S3 and the dissociation energy of AsS,
J. Phys. Chem., 1982, 86, 4429. [all data]
Coppens, Reynaert, et al., 1979
Coppens, P.; Reynaert, J.C.; Drowart, J.,
Mass spectrometric study of the photoionization of carbon disulphide in the wavelength interval 125-60nm,
J. Chem. Soc. Faraday Trans. 2, 1979, 75, 292. [all data]
Tal'roze, Butkovskaya, et al., 1978
Tal'roze, V.L.; Butkovskaya, N.I.; Larichev, M.N.; Leipunskii, I.O.; Morozov, I.I.; Dodonov, A.F.; Kudrov, B.V.; Zelenov, V.V.; Raznikov, V.V.,
Advances in the mass spectrometry of free radicals,
Adv. Mass Spectrom., 1978, 7, 693. [all data]
Smoes, Drowart, et al., 1977
Smoes, S.; Drowart, J.; Welter, J.M.,
Thermodynamic study of the vaporization of europium monosulfide by Knudsen-cell mass spectrometry atomization energies of EuS(g), Eu2S(g), EuS2(g), Eu2O(g), Eu2O2(g), Eu2OS(g), and Eu2S2(g),
J. Chem. Thermodyn., 1977, 9, 275. [all data]
Piacente, Bardi, et al., 1976
Piacente, V.; Bardi, G.; di Paolo, V.; Ferro, D.,
The vapour pressure over Ga2S2 and Ga2Se2,
J. Chem. Thermodyn., 1976, 8, 391. [all data]
Hildenbrand, 1975
Hildenbrand, D.L.,
Vertical ionization potential of the CF2 radical,
Chem. Phys. Lett., 1975, 32, 30. [all data]
Golob, Jonathan, et al., 1975
Golob, L.; Jonathan, N.; Morris, A.; Okuda, M.; Ross, K.J.; Smith, D.J.,
Vacuum ultraviolet photoelectron spectroscopy of transient species,
J. Chem. Soc. Faraday Trans. 2, 1975, 71, 1026. [all data]
Berkowitz, 1975
Berkowitz, J.,
PES of high temperature vapors. VII. S2 and Te2,
J. Chem. Phys., 1975, 62, 4074. [all data]
Muenow and Margrave, 1972
Muenow, D.W.; Margrave, J.L.,
Mass spectrometric observations of gaseous phosphorus sulfides and oxysulfides,
J. Inorg. Nucl. Chem., 1972, 34, 89. [all data]
Hildenbrand, 1972
Hildenbrand, D.L.,
Thermochemistry of the molecules CS and CS+,
Chem. Phys. Lett., 1972, 15, 379. [all data]
Donovan, Husain, et al., 1970
Donovan, R.J.; Husain, D.; Stevenson, C.D.,
Vacuum ultra-violet spectra of transient molecules and radicals. Part 1. CS and S2,
J. Chem. Soc. Faraday Trans., 1970, 66, 1. [all data]
Barrow, duParcq, et al., 1969
Barrow, R.F.; duParcq, R.P.; Ricks, J.M.,
Rotational analysis of the C 3Σu--X 3g- system of 32S2,
J. Phys. B:, 1969, 2, 413. [all data]
Berkowitz and Lifshitz, 1968
Berkowitz, J.; Lifshitz, C.,
Photoionization of high temperature vapors. II. Sulfur molecular species,
J. Chem. Phys., 1968, 48, 4346. [all data]
Wu and Fehlner, 1976
Wu, M.; Fehlner, T.P.,
Valence level photoelectron spectra of some heavy group 4-6 diatomic molecules,
J. Am. Chem. Soc., 1976, 98, 7578. [all data]
Berkowitz and Chupka, 1969
Berkowitz, J.; Chupka, W.A.,
Photoionization of high-temperature vapors. VI. S2, Se2, and Te2,
J. Chem. Phys., 1969, 50, 4245. [all data]
Goodings, Bohme, et al., 1986
Goodings, J.M.; Bohme, D.K.; Elguindi, K.; Fox, A.,
Sulphur Anion Chemistry in Hydrocarbon Flames with H2S, OCS, and SO2 Additives,
Can. J. Chem., 1986, 64, 4, 689, https://doi.org/10.1139/v86-110
. [all data]