2,3-Diamino-2,3-Dimethylbutane
- Formula: C6H16N2
- Molecular weight: 116.2046
- IUPAC Standard InChIKey: CGCVLTOGUMLHNP-UHFFFAOYSA-N
- CAS Registry Number: 20485-44-3
- Chemical structure:
View 3d structure (requires JavaScript / HTML 5) - Other names: 2,3-Butanediamine, 2,3-dimethyl-

Gas phase ion energetics data

Data compiled by: Sharon G. Lias, John E. Bartmess, Joel F. Liebman, John L. Holmes, Rhoda D. Levin, and W. Gary Mallard
Appearance energy determinations
Ion | AE (eV) | Other Products | Method | Reference | Comment |
---|---|---|---|---|---|
C3H8N+ | 8.41 | (CH3)2CNH2 | EI | Burkey, Castelhano, et al., 1983 |

References

Burkey, Castelhano, et al., 1983
Burkey, T.J.; Castelhano, A.L.; Griller, D.; Lossing, F.P.,
Heats of formation and ionization potentials of some α-aminoalkyl radicals,
J. Am. Chem. Soc., 1983, 105, 4701. [all data]