Ethanol-1,1-d2
- Formula: C2H4D2O
- Molecular weight: 48.0808
- IUPAC Standard InChIKey: LFQSCWFLJHTTHZ-CBTSVUPCSA-N
- CAS Registry Number: 1859-09-2
- Chemical structure:
View 3d structure (requires JavaScript / HTML 5) - Isotopologues:

Reaction thermochemistry data

Data compiled by: John E. Bartmess
Individual Reactions
C2H3D5O- + =
By formula: C2H3D5O- + H+ = C2H4D2O
Quantity | Value | Units | Method | Reference | Comment |
---|---|---|---|---|---|
ΔrH° | 1580. ± 9.2 | kJ/mol | G+TS | Dang, Motell, et al., 1993 | gas phase; Acidity 0.35±0.15 weaker than CH3CH2OH |
Quantity | Value | Units | Method | Reference | Comment |
ΔrG° | 1553. ± 8.8 | kJ/mol | CIDC | Dang, Motell, et al., 1993 | gas phase; Acidity 0.35±0.15 weaker than CH3CH2OH |

Gas phase ion energetics data

Data compiled as indicated in comments:
B - John E. Bartmess
RDSH - Henry M. Rosenstock, Keith Draxl, Bruce W. Steiner, and John T. Herron
Appearance energy determinations
Ion | AE (eV) | Other Products | Method | Reference | Comment |
---|---|---|---|---|---|
C2H4DO+ | 10.8 | D | PI | Potapov and Sorokin, 1970 | RDSH |
De-protonation reactions
C2H3D5O- + =
By formula: C2H3D5O- + H+ = C2H4D2O
Quantity | Value | Units | Method | Reference | Comment |
---|---|---|---|---|---|
ΔrH° | 1580. ± 9.2 | kJ/mol | G+TS | Dang, Motell, et al., 1993 | gas phase; Acidity 0.35±0.15 weaker than CH3CH2OH; B |
Quantity | Value | Units | Method | Reference | Comment |
ΔrG° | 1553. ± 8.8 | kJ/mol | CIDC | Dang, Motell, et al., 1993 | gas phase; Acidity 0.35±0.15 weaker than CH3CH2OH; B |

References

Dang, Motell, et al., 1993
Dang, T.T.; Motell, E.L.; Travers, M.J.; Clifford, E.P.; Ellison, G.B.; Depuy, C.H.; Bierbaum, V.M.,
Experimental and Computational Studies of Deuterated Ethanols - Gas-Phase Acidities, Electron Affinities and Bond Dissociation Energies,
Int. J. Mass Spectrom. Ion Proc., 1993, 123, 3, 171, https://doi.org/10.1016/0168-1176(93)87096-B
. [all data]
Potapov and Sorokin, 1970
Potapov, V.K.; Sorokin, V.V.,
Investigation of molecular-ion reactions upon photoionization of methanol and ethanol,
Dokl. Akad. Nauk SSSR, 1970, 192, 590, In original 412. [all data]