Phenol, 2-bromo-, acetate
- Formula: C8H7BrO2
- Molecular weight: 215.044
- IUPAC Standard InChIKey: BEHBHYYPTOHUHX-UHFFFAOYSA-N
- CAS Registry Number: 1829-37-4
- Chemical structure:
View 3d structure (requires JavaScript / HTML 5) - Other names: Phenol, o-bromo-, acetate; o-Acetoxybromobenzene; o-Bromophenyl acetate; 2-Bromophenol acetate; Acetic acid, 2-bromophenyl ester; 2-Bromophenyl acetate

Gas phase ion energetics data

Data compiled by: Sharon G. Lias, Rhoda D. Levin, and Sherif A. Kafafi
Ionization energy determinations
IE (eV) | Method | Reference |
---|---|---|
8.66 ± 0.03 | EI | Benezra and Bursey, 1971 |
Appearance energy determinations
Ion | AE (eV) | Other Products | Method | Reference | Comment |
---|---|---|---|---|---|
C2H3O+ | 12.24 ± 0.03 | ? | EI | Benezra and Bursey, 1971 | |
C5H9N+ | 12.24 ± 0.03 | ? | EI | Benezra and Bursey, 1971 | |
C6H5OBr+ | 9.62 ± 0.03 | CH2=C=O | EI | Benezra and Bursey, 1971 |

Van Den Dool and Kratz RI, non-polar column, temperature ramp

Column type | Active phase | I | Reference | Comment |
---|---|---|---|---|
Capillary | ZB-1 | 1254. | Urbanczyk, Staniewski, et al., 2002 | 30. m/0.25 mm/0.50 μm, He, 50. C @ 3. min, 10. K/min, 280. C @ 10. min |

References

Benezra and Bursey, 1971
Benezra, S.A.; Bursey, M.M.,
ortho-Effects on ordering factors in mass spectral rearrangements. Loss of keten from halogenated phenyl acetates and acetanilides,
J. Chem. Soc. B, 1971, 1515. [all data]
Urbanczyk, Staniewski, et al., 2002
Urbanczyk, A.; Staniewski, J.; Szymanowski, J.,
Abraham model in gas chromatography of phenol pollutants,
Anal. Chim. Acta., 2002, 466, 1, 151-159, https://doi.org/10.1016/S0003-2670(02)00544-5
. [all data]