Peroxide, bis(1-methylethyl)
- Formula: C6H14O2
- Molecular weight: 118.1742
- IUPAC Standard InChIKey: NFPBWZOKGZKYRE-UHFFFAOYSA-N
- CAS Registry Number: 16642-57-2
- Chemical structure:
View 3d structure (requires JavaScript / HTML 5) - Other names: Isopropyl peroxide; Diisopropyl peroxide; (iso-C3H7O)2

Gas phase ion energetics data

Data compiled as indicated in comments:
LLK - Sharon G. Lias, Rhoda D. Levin, and Sherif A. Kafafi
Ionization energy determinations
IE (eV) | Method | Reference | Comment |
---|---|---|---|
9.16 | PE | Coughlin, Brown, et al., 1979 | Vertical value; LLK |

References

Coughlin, Brown, et al., 1979
Coughlin, D.J.; Brown, R.S.; Salomon, R.G.,
The prostaglandin endoperoxide nucleus and related bicyclic peroxides. Synthetic and spectroscopic studies,
J. Am. Chem. Soc., 1979, 101, 1533. [all data]