Lanthanum difluoride
- Formula: F2La
- Molecular weight: 176.90228
- IUPAC Standard InChIKey: BAEYGLIIMIYYPU-UHFFFAOYSA-L
- CAS Registry Number: 15948-68-2
- Chemical structure:
View 3d structure (requires JavaScript / HTML 5) - Permanent link for this species. Use this link for bookmarking this species for future reference.

Gas phase ion energetics data

Data compiled by: Henry M. Rosenstock, Keith Draxl, Bruce W. Steiner, and John T. Herron
Ionization energy determinations
IE (eV) | Method | Reference |
---|---|---|
6.8 ± 0.3 | EI | Zmbov and Margrave, 1968 |

Vibrational and/or electronic energy levels

Data compiled by: Marilyn E. Jacox
State: X
Vib. sym. |
No. | Approximate type of mode |
cm-1 | Med. | Method | References | |
---|---|---|---|---|---|---|---|
a1 | 1 | Sym. stretch | 512.7 | Ar | IR | Wang and Andrews, 2010 | |
b2 | 3 | Asym. stretch | 488.8 | Ar | IR | Wang and Andrews, 2010 | |

References

Zmbov and Margrave, 1968
Zmbov, K.F.; Margrave, J.L.,
Mass spectrometric studies of scandium, yttrium, lanthanum, and rare-earth fluorides,
Advan. Chem. Ser., 1968, 72, 267. [all data]
Wang and Andrews, 2010
Wang, X.; Andrews, L.,
Infrared Spectra of MF,
J. Phys. Chem. A, 2010, 114, 6, 2293, https://doi.org/10.1021/jp910936d
. [all data]