Copper phthalocyanine, CI 74160
- Formula: C32H16CuN8
- Molecular weight: 576.069
- IUPAC Standard InChIKey: XCJYREBRNVKWGJ-UHFFFAOYSA-N
- CAS Registry Number: 147-14-8
- Chemical structure:
View 3d structure (requires JavaScript / HTML 5) - Other names: Copper phthalocyanine; Monastral blue B; Copper(II) phthalocyanine; Phthalocyanine blue; Copper, [29H,31H-phthalocyaninato(2-)-N(29)-,N(30)-,N(31)-,N(32)-]-, (SP-4-1)-; C.I. Pigment Blue 15; Copper,[29H,31H-phthalocyaninato(2(-))-N29,N30,N31,N32]-(SP-4-1)-; Accosperse cyan blue GT; Bahama blue BC; Blue GLA; BT 4651; Ceres blue BHR; Chromofine blue 4920; Copper β-phthalocyanine; α-Copper phthalocyanine; Cromofine blue 4973; Cupric phthalocyanine; Cyanine blue BB; Dainichi cyanine blue B; Duratint blue 1001; Euvinyl blue 702; Fastolux blue; Fenalac blue b disp; Graphtol blue bl; Helio fast blue b; Hostaperm blue afn; Irgalite blue lgld; Irgaplast blue rbp; Aqualine blue; Bermuda blue; Blue phthalocyanine α-form; Blue toner gtnf; Calcotone blue gp; Chromatex blue bn; C.I. 74160; Congo blue B 4; Copper tetrabenzoporphyrazine; ε-Copper phthalocyanine; Cromophtal blue 4G; Cyan Blue BNC 55-3745; 29H,31H-phthalocyaninato(2-)-N29,N30,N31,N32 copper; Pigment Blue 15:3; Pigment Blue 15:4; Pigment Blue 15

Phase change data

Data compiled by: William E. Acree, Jr., James S. Chickos
Enthalpy of sublimation
ΔsubH (kJ/mol) | Temperature (K) | Method | Reference | Comment |
---|---|---|---|---|
266.1 | 657. to 863. | N/A | Hamann, 2010 | |
231.8 ± 2.1 | 618. to 713. | ME | SEMYANNIKOV, BASOVA, et al., 2000 | |
266.1 ± 5.1 | 657. to 722. | ME | Curry and Shaw, 1965 | See also Bonderman, Cater, et al., 1970. |

Gas phase ion energetics data

Data compiled by: Sharon G. Lias, Rhoda D. Levin, and Sherif A. Kafafi
Ionization energy determinations
IE (eV) | Method | Reference |
---|---|---|
7.37 ± 0.10 | EI | Eley, Hazeldine, et al., 1973 |

References

Hamann, 2010
Hamann, Claus,
Der Dampfdruck von Kupferphthalocyanin,
Z. Chem., 2010, 9, 5, 195-196, https://doi.org/10.1002/zfch.19690090522
. [all data]
SEMYANNIKOV, BASOVA, et al., 2000
SEMYANNIKOV, P.P.; BASOVA, T.V.; GRANKIN, V.M.; IGUMENOV, I.K.,
Vapour pressure of some phthalocyanines,
J. Porphyrins Phthalocyanines, 2000, 04, 03, 271-277, https://doi.org/10.1002/(SICI)1099-1409(200004/05)4:3<271::AID-JPP205>3.0.CO;2-4
. [all data]
Curry and Shaw, 1965
Curry, James; Shaw, Robert W.,
The Vapor Pressure of Copper Phthalocyanine,
J. Phys. Chem., 1965, 69, 1, 344-346, https://doi.org/10.1021/j100885a505
. [all data]
Bonderman, Cater, et al., 1970
Bonderman, Dean P.; Cater, E. David; Bennett, William Earl,
Vapor pressures, mass spectra, magnetic susceptibilities, and thermodynamics of some phthalocyanine compounds,
J. Chem. Eng. Data, 1970, 15, 3, 396-400, https://doi.org/10.1021/je60046a004
. [all data]
Eley, Hazeldine, et al., 1973
Eley, D.D.; Hazeldine, D.J.; Palmer, T.F.,
Mass spectra, ionisation potentials and related properties of metal-free transition and metal phthalocyanines,
J. Chem. Soc. Faraday Trans. 2, 1973, 69, 1808. [all data]