Scandium difluoride
- Formula: F2Sc
- Molecular weight: 82.952718
- IUPAC Standard InChIKey: FUDDHUKCKNISNN-UHFFFAOYSA-L
- CAS Registry Number: 14017-34-6
- Chemical structure:
View 3d structure (requires JavaScript / HTML 5) - Permanent link for this species. Use this link for bookmarking this species for future reference.

Gas phase ion energetics data

Data compiled by: Henry M. Rosenstock, Keith Draxl, Bruce W. Steiner, and John T. Herron
Ionization energy determinations
IE (eV) | Method | Reference |
---|---|---|
7.0 ± 0.3 | EI | Zmbov and Margrave, 1967 |

Vibrational and/or electronic energy levels

Data compiled by: Marilyn E. Jacox
State: X
Vib. sym. |
No. | Approximate type of mode |
cm-1 | Med. | Method | References | |
---|---|---|---|---|---|---|---|
a1 | 1 | Sym. stretch | 669.9 | Ar | IR | Wang and Andrews, 2010 | |
b2 | 3 | Asym. stretch | 697.5 | Ar | IR | Wang and Andrews, 2010 | |

References

Zmbov and Margrave, 1967
Zmbov, K.F.; Margrave, J.L.,
Mass spectrometry at high temperatures. XVIII.The stabilities of the mono- and difluorides of scandium and yttrium,
J. Chem. Phys., 1967, 47, 3122. [all data]
Wang and Andrews, 2010
Wang, X.; Andrews, L.,
Infrared Spectra of MF,
J. Phys. Chem. A, 2010, 114, 6, 2293, https://doi.org/10.1021/jp910936d
. [all data]