Pyridazine,1,2,3,6-tetrahydro-1,2,4,5-tetramethyl-
- Formula: C8H16N2
- Molecular weight: 140.2260
- IUPAC Standard InChIKey: CQDACHNBDIABHW-UHFFFAOYSA-N
- CAS Registry Number: 14003-02-2
- Chemical structure:
View 3d structure (requires JavaScript / HTML 5) - Permanent link for this species. Use this link for bookmarking this species for future reference.

Gas phase ion energetics data

Data compiled by: Sharon G. Lias, Rhoda D. Levin, and Sherif A. Kafafi
Ionization energy determinations
IE (eV) | Method | Reference | Comment |
---|---|---|---|
7.92 | PE | Nelsen and Buschek, 1974 | Vertical value |

References

Nelsen and Buschek, 1974
Nelsen, S.F.; Buschek, J.M.,
Photoelectron spectra of hydrazines. V. Pyrazolidine and hexahydropyridazine derivatives,
J. Am. Chem. Soc., 1974, 96, 6987. [all data]