Disilicon mononitride
- Formula: NSi2
- Molecular weight: 70.1777
- CAS Registry Number: 12293-67-3

Gas phase ion energetics data

Data compiled as indicated in comments:
LLK - Sharon G. Lias, Rhoda D. Levin, and Sherif A. Kafafi
RDSH - Henry M. Rosenstock, Keith Draxl, Bruce W. Steiner, and John T. Herron
Ionization energy determinations
IE (eV) | Method | Reference | Comment |
---|---|---|---|
9.3 ± 0.5 | EI | Muenow, 1974 | LLK |
9.5 ± 0.5 | EI | Muenow, 1973 | LLK |
9.4 ± 0.3 | EI | Zmbov and Margrave, 1967 | RDSH |

Vibrational and/or electronic energy levels

Data compiled by: Marilyn E. Jacox
State: 2Su+
Energy (cm-1) |
Med. | Transition | λmin (nm) |
λmax (nm) |
References | ||
---|---|---|---|---|---|---|---|
To = 34314.29 | gas | 2Su+-X | 275 | 315 | Brugh and Morse, 1997 | ||
State: X
Vib. sym. |
No. | Approximate type of mode |
cm-1 | Med. | Method | References | |
---|---|---|---|---|---|---|---|
Σu+ | 3 | Asym. stretch | 904.0 | Ar | IR | Meloni, Nunziante Cesaro, et al., 2001 | |
3 | Asym. stretch | 910.0 | N2 | IR | Meloni, Nunziante Cesaro, et al., 2001 | ||
Additional references: Jacox, 1998, page 174; Jacox, 2003, page 101

References

Muenow, 1974
Muenow, D.W.,
Mass spectrometric determination of the heats of formation and atomization energies of the molecules Ge2N and GeSiN,
J. Chem. Phys., 1974, 60, 3382. [all data]
Muenow, 1973
Muenow, D.W.,
Mass spectrometric evidence for the gaseous silicon oxide nitride molecule and its heat of atomizaton,
J. Phys. Chem., 1973, 77, 970. [all data]
Zmbov and Margrave, 1967
Zmbov, K.F.; Margrave, J.L.,
Mass spectrometric evidence for the gaseous Si2N molecule,
J. Am. Chem. Soc., 1967, 89, 2492. [all data]
Brugh and Morse, 1997
Brugh, D.J.; Morse, M.D.,
Resonant two-photon ionization spectroscopy of the 13-electron triatomic Si2N,
Chem. Phys. Lett., 1997, 267, 3-4, 370, https://doi.org/10.1016/S0009-2614(97)00108-5
. [all data]
Meloni, Nunziante Cesaro, et al., 2001
Meloni, G.; Nunziante Cesaro, S.; Sanna, N.,
FTIR matrix isolation and ab initio investigations of the Si2N and BNSi molecules,
Chem. Phys. Lett., 2001, 343, 1-2, 113, https://doi.org/10.1016/S0009-2614(01)00663-7
. [all data]
Jacox, 1998
Jacox, M.E.,
Vibrational and electronic energy levels of polyatomic transient molecules: supplement A,
J. Phys. Chem. Ref. Data, 1998, 27, 2, 115-393, https://doi.org/10.1063/1.556017
. [all data]
Jacox, 2003
Jacox, M.E.,
Vibrational and electronic energy levels of polyatomic transient molecules: supplement B,
J. Phys. Chem. Ref. Data, 2003, 32, 1, 1-441, https://doi.org/10.1063/1.1497629
. [all data]