Benzene, 1-methoxy-2,4-dinitro-
- Formula: C7H6N2O5
- Molecular weight: 198.1329
- IUPAC Standard InChIKey: CVYZVNVPQRKDLW-UHFFFAOYSA-N
- CAS Registry Number: 119-27-7
- Chemical structure:
View 3d structure (requires JavaScript / HTML 5) - Other names: Anisole, 2,4-dinitro-; α-Dinitroanisole; Dinitroanisole; 1-Methoxy-2,4-dinitrobenzene; 2,4-Dinitroanisol; 2,4-Dinitroanisole; 2,4-Dinitrophenyl methyl ether; 2,4-Dinitro-1-methoxy-benzene; 2,4-Nitroanisole; NSC 8733

Condensed phase thermochemistry data

Data compiled by: Hussein Y. Afeefy, Joel F. Liebman, and Stephen E. Stein
Quantity | Value | Units | Method | Reference | Comment |
---|---|---|---|---|---|
ΔcH°solid | -3425.4 ± 3.4 | kJ/mol | Ccb | Badoche, 1942 | Reanalyzed by Cox and Pilcher, 1970, Original value = -3427.9 kJ/mol |
ΔcH°solid | -3425.4 ± 3.4 | kJ/mol | Ccb | Burlot, 1939 | Reanalyzed by Cox and Pilcher, 1970, Original value = -3433. kJ/mol |

Phase change data

Data compiled by: Thermodynamics Research Center, NIST Boulder Laboratories, Chris Muzny director
Quantity | Value | Units | Method | Reference | Comment |
---|---|---|---|---|---|
Tfus | 359.9 | K | N/A | Beringer, Brierley, et al., 1953 | Uncertainty assigned by TRC = 1.5 K |

Gas phase ion energetics data

Data compiled by: Sharon G. Lias, Rhoda D. Levin, and Sherif A. Kafafi
Ionization energy determinations
IE (eV) | Method | Reference |
---|---|---|
9.30 | PE | Dougherty, Younathan, et al., 1978 |

References

Badoche, 1942
Badoche, M.,
Chaleurs de combustion de derives nitres phenoliques,
Bull. Soc. Chim. France, 1942, 9, 86-95. [all data]
Cox and Pilcher, 1970
Cox, J.D.; Pilcher, G.,
Thermochemistry of Organic and Organometallic Compounds, Academic Press, New York, 1970, 1-636. [all data]
Burlot, 1939
Burlot, E.,
Etude relative a la calorimetrie des explosifs,
Mem. Poudres, 1939, 29, 226-260. [all data]
Beringer, Brierley, et al., 1953
Beringer, F.M.; Brierley, A.; Drexler, M.; Gindler, E.M.; Lumpkin, C.C.,
Diaryliodonium Salts II. The Phenylation of Organic and Inorganic Bases,
J. Am. Chem. Soc., 1953, 75, 2708. [all data]
Dougherty, Younathan, et al., 1978
Dougherty, D.; Younathan, E.S.; Voll, R.; Abdulnur, S.; McGlynn, S.P.,
Photoelectron spectroscopy of some biological molecules,
J. Electron Spectrosc. Relat. Phenom., 1978, 13, 379. [all data]