Pyrazine, tetramethyl-
- Formula: C8H12N2
- Molecular weight: 136.1943
- IUPAC Standard InChIKey: FINHMKGKINIASC-UHFFFAOYSA-N
- CAS Registry Number: 1124-11-4
- Chemical structure:
View 3d structure (requires JavaScript / HTML 5) - Other names: BS Factor; Tetramethylpyrazine; 2,3,5,6-Tetramethylpyrazine; Tetramethylpyrazin; Pyrazine, 2,3,5,6-tetramethyl

Gas phase thermochemistry data

Data compiled by: Hussein Y. Afeefy, Joel F. Liebman, and Stephen E. Stein
Quantity | Value | Units | Method | Reference | Comment |
---|---|---|---|---|---|
ΔfH°gas | 54.7 ± 4.5 | kJ/mol | Ccb | Ribeiro da Silva, Morais, et al., 1996 |

Condensed phase thermochemistry data

Data compiled by: Hussein Y. Afeefy, Joel F. Liebman, and Stephen E. Stein
Quantity | Value | Units | Method | Reference | Comment |
---|---|---|---|---|---|
ΔfH°solid | -39.9 ± 2.0 | kJ/mol | Ccb | Ribeiro da Silva, Morais, et al., 1996 | |
Quantity | Value | Units | Method | Reference | Comment |
ΔcH°solid | -4823.2 ± 1.7 | kJ/mol | Ccb | Ribeiro da Silva, Morais, et al., 1996 |

Phase change data

Data compiled as indicated in comments:
BS - Robert L. Brown and Stephen E. Stein
TRC - Thermodynamics Research Center, NIST Boulder Laboratories, Chris Muzny director
ALS - Hussein Y. Afeefy, Joel F. Liebman, and Stephen E. Stein
DRB - Donald R. Burgess, Jr.
AC - William E. Acree, Jr., James S. Chickos
Quantity | Value | Units | Method | Reference | Comment |
---|---|---|---|---|---|
Tboil | 463.2 | K | N/A | Aldrich Chemical Company Inc., 1990 | BS |
Quantity | Value | Units | Method | Reference | Comment |
Tfus | 358.5 | K | N/A | Anonymous, 1954 | Uncertainty assigned by TRC = 0.3 K; TRC |
Quantity | Value | Units | Method | Reference | Comment |
ΔsubH° | 94.6 ± 4.0 | kJ/mol | C | Ribeiro da Silva, Morais, et al., 1996 | ALS |
ΔsubH° | 94.6 | kJ/mol | N/A | Ribeiro da Silva, Morais, et al., 1996 | DRB |
ΔsubH° | 94.6 ± 4.0 | kJ/mol | C | Ribeiro da Silva, Morais, et al., 1996 | AC |

Gas phase ion energetics data

Data compiled by: Sharon G. Lias, Rhoda D. Levin, and Sherif A. Kafafi
Ionization energy determinations
IE (eV) | Method | Reference | Comment |
---|---|---|---|
8.6 | PE | Bischof, Gleiter, et al., 1974 | Vertical value |

Normal alkane RI, non-polar column, temperature ramp

Data compiled by: NIST Mass Spectrometry Data Center, William E. Wallace, director

Column type CapillaryCapillaryCapillaryCapillaryCapillary
Active phase DB-5HP-5DB-5DB-5MSOV-101
Column length (m) 60.30.30.50.50.
Carrier gas HeHeHeHeHe
Substrate
Column diameter (mm) 0.320.250.250.250.32
Phase thickness (μm)  0.250.25 0.5
Tstart (C) 50.60.60.40.50.
Tend (C) 250.250.240.220.250.
Heat rate (K/min) 4.10.3.5.4.
Initial hold (min) 5.2. 5.
Final hold (min)  10. 5.
I 1085.1090.1084.1095.1061.
ReferenceFadel, Mageed, et al., 2006Wang, Yang, et al., 2006Tellez, Khan, et al., 2004Welty, Marshall, et al., 2001Misharina, Golovnya, et al., 1991
Comment MSDC-RI MSDC-RI MSDC-RI MSDC-RI MSDC-RI
Column type CapillaryCapillaryCapillaryCapillaryCapillary
Active phase OV-101OV-101OV-1DB-5OV-101
Column length (m) 50.50.50.60.50.
Carrier gas HeN2HydrogenH2N2
Substrate
Column diameter (mm) 0.320.220.200.320.22
Phase thickness (μm) 0.5
Tstart (C) 50.80.50.40.80.
Tend (C) 250.200.200.200.200.
Heat rate (K/min) 4.2.1.2.2.
Initial hold (min)
Final hold (min)   35.
I 1064.1067.1058.1088.1067.
ReferenceMisharina, Golovnya, et al., 1991Mihara and Masuda, 1987Wu, Liou, et al., 1987Gallois and Grimont, 1985Mihara and Enomoto, 1985
Comment MSDC-RI MSDC-RI MSDC-RI MSDC-RI MSDC-RI
Column type Capillary
Active phase OV-101
Column length (m) 50.
Carrier gas He
Substrate
Column diameter (mm) 0.31
Phase thickness (μm)
Tstart (C) 0.
Tend (C) 225.
Heat rate (K/min) 3.
Initial hold (min) 1.
Final hold (min)
I 1060.
Referencedel Rosario, de Lumen, et al., 1984
Comment MSDC-RI

Van Den Dool and Kratz RI, non-polar column, custom temperature program

Data compiled by: NIST Mass Spectrometry Data Center, William E. Wallace, director

Column type CapillaryCapillaryCapillary
Active phase HP-5MSZB-5BPX-5
Column length (m) 30.30.50.
Carrier gas HeHeHe
Substrate
Column diameter (mm) 0.250.250.32
Phase thickness (μm) 0.250.250.5
Program 60C (1 min) => 5 C/min => 210C => 10 C/min => 280C (15 min)50C(1min) => 3C/min => 209C => 20C/min => 280COC => 60C/min => 60C(5min) => 4C/min => 250C(20min)
I 1087.31061.1098.
ReferenceAndriamaharavo, 2014Lu, Hao, et al., 2005Owens J.D., Allagheny N., et al., 1997
Comment MSDC-RI MSDC-RI MSDC-RI

Kovats' RI, non-polar column, isothermal

Data compiled by: NIST Mass Spectrometry Data Center, William E. Wallace, director

Column type CapillaryCapillaryCapillaryCapillary
Active phase SE-30SE-30OV-101OV-101
Column length (m) 25.25.50.50.
Carrier gas HeHeHeHe
Substrate
Column diameter (mm) 0.320.320.250.25
Phase thickness (μm) 1.1.
Temperature (C) 110.80.110.80.
I 1096.1091.1096.1091.
ReferenceSamusenko and Golovnya, 1988Samusenko and Golovnya, 1988Golovnya, Samusenko, et al., 1987Golovnya, Samusenko, et al., 1987
Comment MSDC-RI MSDC-RI MSDC-RI MSDC-RI

References

Ribeiro da Silva, Morais, et al., 1996
Ribeiro da Silva, M.A.V.; Morais, V.M.F.; Matos, M.A.R.; Rio, C.M.A.; Piedade, G.M.G.S.,
Thermochemical and theoretical study of some methyldiazines,
Struct. Chem., 1996, 7, 329-336. [all data]
Aldrich Chemical Company Inc., 1990
Aldrich Chemical Company Inc.,
Catalog Handbook of Fine Chemicals, Aldrich Chemical Company, Inc., Milwaukee WI, 1990, 1. [all data]
Anonymous, 1954
Anonymous, R.,
, Am. Pet. Inst. Res. Proj. 45, Tech. Rep. 13, Ohio State Univ., 1954. [all data]
Bischof, Gleiter, et al., 1974
Bischof, P.; Gleiter, R.; Hofmann, P.,
Reversal in the sequence of the two highest occupied molecular orbitals in the series pyrazine, 2,6-dimethylpyrazine, and tetramethylpyrazine,
J. Chem. Soc., Chem. Commun., 1974, 767. [all data]