Ethanol, 2-ethoxy-
- Formula: C4H10O2
- Molecular weight: 90.1210
- IUPAC Standard InChIKey: ZNQVEEAIQZEUHB-UHFFFAOYSA-N
- CAS Registry Number: 110-80-5
- Chemical structure:
View 3d structure (requires JavaScript / HTML 5) - Other names: β-Ethoxyethanol; Cellosolve; Emkanol; Ethyl cellosolve; Ethylene glycol ethyl ether; Ethylene glycol monoethyl ether; Glycol monoethyl ether; Oxitol; Plastiazan 60; Poly-Solv EE; 2-Ethoxyethanol; HOCH2CH2OC2H5; Cellosolve solvent; 2-Ethoxyethyl alcohol; Ethyl-2-hydroxyethyl ether; Dowanol EE; Ether monoethylique de l'ethylene-glycol; Ethyl glycol; Ethylethylene glycol; Etoksyetylowy alkohol; Glycol ethyl ether; Hydroxy ether; NCI-C54853; 2EE; EE solvent; EGEE; Ektasolve EE; Ethoxyethanol; Ethyl icinol; Glycol ether EE; Jeffersol EE; Bikanol E 1; NSC 8837; Solvid; 2-ethoxyethanol (cellosolve)

Condensed phase thermochemistry data

Data compiled by: Eugene S. Domalski and Elizabeth D. Hearing
Constant pressure heat capacity of liquid
Cp,liquid (J/mol*K) | Temperature (K) | Reference | Comment |
---|---|---|---|
209.82 | 298.15 | Svoboda, Zabransky, et al., 1991 | T = 298 to 330 K. Cp(liq) = 84.928 + 0.4189(T/K) J/mol*K. Cp value calculated from equation. |
210.5 | 298.15 | Roux, Perron, et al., 1978 | T = 283.15, 298.15, 313.15 K. Data at three temperatures. |
210.8 | 298.15 | Kusano, Suurkuusk, et al., 1973 |

Phase change data

Data compiled as indicated in comments:
BS - Robert L. Brown and Stephen E. Stein
TRC - Thermodynamics Research Center, NIST Boulder Laboratories, Chris Muzny director
AC - William E. Acree, Jr., James S. Chickos
Quantity | Value | Units | Method | Reference | Comment |
---|---|---|---|---|---|
Tboil | 408.2 ± 0.3 | K | AVG | N/A | Average of 7 values; Individual data points |
Quantity | Value | Units | Method | Reference | Comment |
ΔvapH° | 48.23 | kJ/mol | N/A | Majer and Svoboda, 1985 | |
ΔvapH° | 49.4 | kJ/mol | EB | Antosik, Fras, et al., 1999 | Based on data from 313. to 353. K.; AC |
ΔvapH° | 50.0 | kJ/mol | EB | Antosik, Fras, et al., 1999 | Based on data from 313. to 363. K.; AC |
ΔvapH° | 48.2 ± 0.1 | kJ/mol | C | Kusano, Wadsö, et al., 1971 | AC |
ΔvapH° | 49.2 | kJ/mol | I | Sunwoo and Eisen, 1971 | AC |
Enthalpy of vaporization
ΔvapH (kJ/mol) | Temperature (K) | Method | Reference | Comment |
---|---|---|---|---|
39.22 | 408.1 | N/A | Majer and Svoboda, 1985 | |
45.9 | 338. | TGA | Al-Najjar and Al-Sammerrai, 2007 | Based on data from 323. to 353. K.; AC |
47.4 | 325. | EB | Chylinski, Fras, et al., 2001 | Based on data from 310. to 385. K.; AC |
44.7 | 351. | A | Stephenson and Malanowski, 1987 | Based on data from 336. to 408. K. See also Pick, Fried, et al., 1956.; AC |
Antoine Equation Parameters
log10(P) = A − (B / (T + C))
P = vapor pressure (bar)
T = temperature (K)
View plot Requires a JavaScript / HTML 5 canvas capable browser.
Temperature (K) | A | B | C | Reference | Comment |
---|---|---|---|---|---|
336. to 407. | 4.86877 | 1756.857 | -46.92 | Pick, Fried, et al., 1956, 2 | Coefficents calculated by NIST from author's data. |

Gas phase ion energetics data

Data compiled by: Sharon G. Lias, Rhoda D. Levin, and Sherif A. Kafafi
Ionization energy determinations
IE (eV) | Method | Reference | Comment |
---|---|---|---|
9.6 | PE | Kimura, Katsumata, et al., 1981 | |
9.97 | PE | Kimura, Katsumata, et al., 1981 | Vertical value |
Appearance energy determinations
Ion | AE (eV) | Other Products | Method | Reference | Comment |
---|---|---|---|---|---|
C3H7O+ | 10.26 | CH2OH | EI | Lossing, 1977 |

Kovats' RI, non-polar column, isothermal

Column type | Active phase | Temperature (C) | I | Reference | Comment |
---|---|---|---|---|---|
Capillary | SPB-1 | 60. | 687. | Castello, Vezzani, et al., 1991 | N2; Column length: 60. m; Column diameter: 0.75 mm |
Packed | Porapack Q | 200. | 671. | Goebel, 1982 | N2 |
Packed | SE-30 | 150. | 694. | Haken, Nguyen, et al., 1979 | Celatom AW silanized; Column length: 3.7 m |
Packed | Apiezon L | 120. | 666. | Bogoslovsky, Anvaer, et al., 1978 | Celite 545 |
Packed | Apiezon L | 160. | 670. | Bogoslovsky, Anvaer, et al., 1978 | Celite 545 |
Packed | Apiezon L | 170. | 718. | Singliar and Dykyj, 1969 |

Kovats' RI, polar column, isothermal

Column type | Active phase | Temperature (C) | I | Reference | Comment |
---|---|---|---|---|---|
Capillary | Supelcowax-10 | 60. | 1231. | Castello, Vezzani, et al., 1991 | N2; Column length: 60. m; Column diameter: 0.75 mm |
Packed | Carbowax 20M | 75. | 1266. | Goebel, 1982 | N2, Kieselgur (60-100 mesh); Column length: 2. m |

Van Den Dool and Kratz RI, non-polar column, temperature ramp

Column type | Active phase | I | Reference | Comment |
---|---|---|---|---|
Capillary | Ultra-2 | 708. | Poskrobko, Linkiewicz, et al., 1994 | 25. m/0.32 mm/0.52 μm, H2, 8. K/min; Tstart: 50. C; Tend: 310. C |
Capillary | DB-5 | 716. | Olson, Wong, et al., 1987 | 30. m/0.32 mm/1.0 μm, 5. K/min; Tstart: 20. C; Tend: 200. C |

Van Den Dool and Kratz RI, non-polar column, custom temperature program

Column type | Active phase | I | Reference | Comment |
---|---|---|---|---|
Capillary | VF-5MS | 743.5 | Zheng and White, 2008 | 30. m/0.25 mm/0.25 μm, He; Program: not specified |
Packed | SE-30 | 702. | Peng, Ding, et al., 1988 | Supelcoport; Chromosorb; Column length: 3.05 m; Program: 40C(5min) => 10C/min => 200C or 250C (60min) |
Packed | SE-30 | 702. | Peng, Ding, et al., 1988 | Supelcoport; Chromosorb; Column length: 3.05 m; Program: 40C(5min) => 10C/min => 200C or 250C (60min) |

Normal alkane RI, non-polar column, isothermal

Column type | Active phase | Temperature (C) | I | Reference | Comment |
---|---|---|---|---|---|
Capillary | DB-1 | 60. | 695. | Shimadzu, 2003 | 60. m/0.32 mm/1. μm, He |
Packed | DC-400 | 150. | 702. | Anderson, 1968 | Helium, Gas-Pak (60-80 mesh); Column length: 3.0 m |

Normal alkane RI, non-polar column, temperature ramp

Column type | Active phase | I | Reference | Comment |
---|---|---|---|---|
Capillary | BP-1 | 695. | Health Safety Executive, 2000 | 50. m/0.22 mm/0.75 μm, He, 5. K/min; Tstart: 50. C; Tend: 200. C |
Capillary | DB-5 | 716.5 | Olson, Wong, et al., 1988 | 30. m/0.32 mm/1. μm, 5. K/min; Tstart: 20. C; Tend: 200. C |

Normal alkane RI, non-polar column, custom temperature program

Column type | Active phase | I | Reference | Comment |
---|---|---|---|---|
Capillary | SPB-1 | 694. | Flanagan, Streete, et al., 1997 | 60. m/0.53 mm/5. μm, He; Program: 40C(6min) => 5C/min => 80C => 10C/min => 200C |
Capillary | SPB-1 | 694. | Strete, Ruprah, et al., 1992 | 60. m/0.53 mm/5.0 μm, Helium; Program: 40 0C (6 min) 5 0C/min -> 80 0C 10 0C/min -> 200 0C |
Capillary | SPB-1 | 701. | Strete, Ruprah, et al., 1992 | 60. m/0.53 mm/5.0 μm, Helium; Program: not specified |
Capillary | OV-1 | 701. | Ramsey and Flanagan, 1982 | Program: not specified |

Normal alkane RI, polar column, isothermal

Column type | Active phase | Temperature (C) | I | Reference | Comment |
---|---|---|---|---|---|
Capillary | DB-Wax | 60. | 1246. | Shimadzu, 2003 | 50. m/0.32 mm/1. μm, He |

Normal alkane RI, polar column, temperature ramp

Column type | Active phase | I | Reference | Comment |
---|---|---|---|---|
Capillary | DB-Wax | 1239. | Shimadzu, 2012 | 30. m/0.32 mm/0.50 μm, Helium, 4. K/min; Tstart: 40. C; Tend: 260. C |
Capillary | DB-Wax | 1239. | Shimadzu Corporation, 2003 | 30. m/0.32 mm/0.5 μm, He, 4. K/min; Tstart: 40. C; Tend: 260. C |

Normal alkane RI, polar column, custom temperature program

Column type | Active phase | I | Reference | Comment |
---|---|---|---|---|
Capillary | Carbowax 20M | 1218. | Ramsey and Flanagan, 1982 | Program: not specified |

References

Svoboda, Zabransky, et al., 1991
Svoboda, V.; Zabransky, M.; Barta, M.,
Molar heat capacities of 2-methoxyethanol, 2-ethoxyethanol, and 2-propoxyethanol in the temperature range from 298K to 330K,
J. Chem. Thermodynam., 1991, 23, 711-712. [all data]
Roux, Perron, et al., 1978
Roux, G.; Perron, G.; Desnoyers, J.E.,
Model systems for hydrophobic interactions: volumes and heat capacities of n-alkoxyethanols in water,
J. Solution Chem., 1978, 7, 639-654. [all data]
Kusano, Suurkuusk, et al., 1973
Kusano, K.; Suurkuusk, J.; Wads, I.,
Thermochemistry of solutions of biochemical model compounds. 2. Alkoxyethanols and 1,2-dialkoxyethanes in water, J. Chem. Thermodynam. 5,757-767 (1973).73LEB/TSV Lebedev, B.V., Tsvetkova, L.Ya., and Rabinovich, I.B., Specific heat and thermodynamic functions of poly(vinyltrimethylsilane),
Tr. Khim. Khim. Tekhnol., 1973, (1), 17-18. [all data]
Majer and Svoboda, 1985
Majer, V.; Svoboda, V.,
Enthalpies of Vaporization of Organic Compounds: A Critical Review and Data Compilation, Blackwell Scientific Publications, Oxford, 1985, 300. [all data]
Antosik, Fras, et al., 1999
Antosik, Maria; Fras, Zbigniew; Malanowski, Stanislaw K.,
Vapor-Liquid Equilibrium in 2-Ethoxyethanol + Methanol at 313.15 to 333.15 K,
J. Chem. Eng. Data, 1999, 44, 3, 368-372, https://doi.org/10.1021/je9801011
. [all data]
Kusano, Wadsö, et al., 1971
Kusano, Kazuhito; Wadsö, Ingemar; Rømming, Chr.; Lindberg, Alf A.; Lagerlund, Inger; Ehrenberg, L.,
Enthalpies of Vaporization of Organic Compounds. VIII. Alkoxyethanols.,
Acta Chem. Scand., 1971, 25, 219-224, https://doi.org/10.3891/acta.chem.scand.25-0219
. [all data]
Sunwoo and Eisen, 1971
Sunwoo, Chimin; Eisen, Henry,
Solubility parameter of selected sulfonamides,
J. Pharm. Sci., 1971, 60, 2, 238-244, https://doi.org/10.1002/jps.2600600217
. [all data]
Al-Najjar and Al-Sammerrai, 2007
Al-Najjar, Hazim; Al-Sammerrai, Dhoaib,
Thermogravimetric determination of the heat of vaporization of some highly polar solvents,
J. Chem. Technol. Biotechnol., 2007, 37, 3, 145-152, https://doi.org/10.1002/jctb.280370302
. [all data]
Chylinski, Fras, et al., 2001
Chylinski, K.; Fras, Z.; Malanowski, S.K.,
Vapor-Liquid Equilibrium in Phenol + 2-Ethoxyethanol at 363.15 to 383.15 K,
J. Chem. Eng. Data, 2001, 46, 1, 29-33, https://doi.org/10.1021/je0001072
. [all data]
Stephenson and Malanowski, 1987
Stephenson, Richard M.; Malanowski, Stanislaw,
Handbook of the Thermodynamics of Organic Compounds, 1987, https://doi.org/10.1007/978-94-009-3173-2
. [all data]
Pick, Fried, et al., 1956
Pick, J.; Fried, V.; Hala, E.; Vilim, O.,
Collect. Czech. Chem. Commun., 1956, 21, 260. [all data]
Pick, Fried, et al., 1956, 2
Pick, J.; Fried, V.; Hala, E.; Vilim, O.,
Der Dampfdruck des Athylenglykolmonomethylathers und des Athylenglykolmonoathylathers,
Collect. Czech. Chem. Commun., 1956, 21, 1, 260-261, https://doi.org/10.1135/cccc19560260
. [all data]
Kimura, Katsumata, et al., 1981
Kimura, K.; Katsumata, S.; Achiba, Y.; Yamazaki, T.; Iwata, S.,
Ionization energies, Ab initio assignments, and valence electronic structure for 200 molecules
in Handbook of HeI Photoelectron Spectra of Fundamental Organic Compounds, Japan Scientific Soc. Press, Tokyo, 1981. [all data]
Lossing, 1977
Lossing, F.P.,
Heats of formation of some isomeric [CnH2n+1]+ ions. Substitutional effects on ion stability,
J. Am. Chem. Soc., 1977, 99, 7526. [all data]