Boron trifluoride etherate
- Formula: C4H10BF3O
- Molecular weight: 141.928
- IUPAC Standard InChIKey: MZTVMRUDEFSYGQ-UHFFFAOYSA-N
- CAS Registry Number: 109-63-7
- Chemical structure:
View 3d structure (requires JavaScript / HTML 5) - Other names: Boron trifluoride diethyl etherate; Boron trifluoride-ethyl ether complex; Boron trifluoride diethyl etherate complex; Boron trifluoride ethyl etherate; Boron trifluoride diethyl ether complex; Boron fluoride-ethyl ether complex; Boron, trifluoro[1,1'-oxybis[ethane]]-, (T-4)-; Ethyl ether, compd. with boron fluoride (BF3) (1:1); Borane, trifluoro-, compd. with 1,1'-oxybis(ethane) (1:1); Boron fluoride diethyl etherate; Boron fluoride etherate; Boron fluoride-ethyl etherate; Boron fluoride monoetherate; Boron trifluoride-ether complex; Boron trifluoride-ethyl ether; Trifluoroborane diethyl etherate; Trifluoroboron etherate; UN 2604; Boron fluoride diethyl ether complex; Boron trifluoride ethyl etherate (1:1); Diethyl ether trifluoroborane complex; Ethyl ether, cmpd with boron fluoride (BF3) (1:1); Trifluoroborane-1,1'-oxybis(ethane) (1:1); diethyl ether--boron trifluoride

Phase change data

Data compiled by: Robert L. Brown and Stephen E. Stein
Quantity | Value | Units | Method | Reference | Comment |
---|---|---|---|---|---|
Tboil | 399. to 400. | K | N/A | PCR Inc., 1990 | |
Tboil | 397. | K | N/A | American Tokyo Kasei, 1988 |

Gas phase ion energetics data

Data compiled by: Sharon G. Lias, Rhoda D. Levin, and Sherif A. Kafafi
Appearance energy determinations
Ion | AE (eV) | Other Products | Method | Reference | Comment |
---|---|---|---|---|---|
BF3+ | 15.00 ± 0.10 | (C2H5)2O | EI | Murphy and Enrione, 1971 |

References

PCR Inc., 1990
PCR Inc.,
Research Chemicals Catalog 1990-1991, PCR Inc., Gainesville, FL, 1990, 1. [all data]
American Tokyo Kasei, 1988
American Tokyo Kasei,
TCI American Organic Chemical 88/89 Catalog, American Tokyo Kasei, Portland, OR, 1988, 1610. [all data]
Murphy and Enrione, 1971
Murphy, C.B., Jr.; Enrione, R.E.,
Mass spectrometric determination of bond dissociation energies in BF3.OEt2,
Chem. Commun., 1971, 1622. [all data]