Acetic acid ethenyl ester
- Formula: C4H6O2
- Molecular weight: 86.0892
- IUPAC Standard InChIKey: XTXRWKRVRITETP-UHFFFAOYSA-N
- CAS Registry Number: 108-05-4
- Chemical structure:
View 3d structure (requires JavaScript / HTML 5) - Other names: Acetic acid vinyl ester; Vinyl acetate; Vinyl A monomer; VyAc; 1-Acetoxyethylene; CH3CO2CH=CH2; Ethenyl acetate; Ethenyl ethanoate; Acetate de vinyle; Ethanoic acid, ethenyl ester; Octan winylu; Vinile (acetato di); Vinyl acetate h.q.; Vinyl ethanoate; Vinylacetaat; Vinylacetat; Vinyle (acetate de); Zeset T; Acetic acid, ethylene ether; VAC; Vinylester kyseliny octove; Vinyl ester of acetic acid; Everflex 81L; Plyamul 40305-00; Unocal 76 Res 6206; Unocal 76 Res S-55; Vinnapas A 50; Vinyl acetate monomer; Acetoxyethene; NSC 8404

Gas phase thermochemistry data

Data compiled as indicated in comments:
DRB - Donald R. Burgess, Jr.
GT - Glushko Thermocenter, Russian Academy of Sciences, Moscow
Quantity | Value | Units | Method | Reference | Comment |
---|---|---|---|---|---|
ΔfH°gas | -313.6 | kJ/mol | N/A | Vilcu and Perisanu, 1980 | Value computed using ΔfHliquid° value of -350.8 kj/mol from Vilcu and Perisanu, 1980 and ΔvapH° value of 37.2±0.84 kj/mol from missing citation.; DRB |
ΔfH°gas | -309. ± 10. | kJ/mol | N/A | Vilcu and Perisanu, 1980 | Value computed using ΔfHliquid° value of -346±10 kj/mol from Vilcu and Perisanu, 1980 and ΔvapH° value of 37.2±0.84 kj/mol from missing citation.; DRB |
Constant pressure heat capacity of gas
Cp,gas (J/mol*K) | Temperature (K) | Reference | Comment |
---|---|---|---|
52.89 | 100. | Kudchadker S.A., 1975 | GT |
74.94 | 200. | ||
92.75 | 273.15 | ||
99.00 | 298.15 | ||
99.47 | 300. | ||
123.71 | 400. | ||
144.97 | 500. | ||
162.76 | 600. | ||
177.57 | 700. | ||
190.03 | 800. | ||
200.61 | 900. | ||
209.64 | 1000. | ||
217.38 | 1100. | ||
224.04 | 1200. | ||
229.78 | 1300. | ||
234.75 | 1400. | ||
239.07 | 1500. |

Condensed phase thermochemistry data

Data compiled as indicated in comments:
ALS - Hussein Y. Afeefy, Joel F. Liebman, and Stephen E. Stein
DH - Eugene S. Domalski and Elizabeth D. Hearing
Quantity | Value | Units | Method | Reference | Comment |
---|---|---|---|---|---|
ΔfH°liquid | -350.8 | kJ/mol | Chyd | Vilcu and Perisanu, 1980 | ALS |
ΔfH°liquid | -346. ± 10. | kJ/mol | Ccb | Vilcu and Perisanu, 1980 | ALS |
Quantity | Value | Units | Method | Reference | Comment |
ΔcH°liquid | -2086. ± 10. | kJ/mol | Ccb | Vilcu and Perisanu, 1980 | Corresponding ΔfHºliquid = -345.8 kJ/mol (simple calculation by NIST; no Washburn corrections); ALS |
Constant pressure heat capacity of liquid
Cp,liquid (J/mol*K) | Temperature (K) | Reference | Comment |
---|---|---|---|
169.5 | 298. | Bengough and Thomson, 1959 | Mean value 23 to 50°C.; DH |

Phase change data

Data compiled as indicated in comments:
TRC - Thermodynamics Research Center, NIST Boulder Laboratories, Chris Muzny director
BS - Robert L. Brown and Stephen E. Stein
ALS - Hussein Y. Afeefy, Joel F. Liebman, and Stephen E. Stein
AC - William E. Acree, Jr., James S. Chickos
Quantity | Value | Units | Method | Reference | Comment |
---|---|---|---|---|---|
Tboil | 345.7 ± 0.6 | K | AVG | N/A | Average of 9 values; Individual data points |
Quantity | Value | Units | Method | Reference | Comment |
Tfus | 172.95 | K | N/A | Dolliver, Gresham, et al., 1938 | Uncertainty assigned by TRC = 0.3 K; TRC |
Quantity | Value | Units | Method | Reference | Comment |
Tc | 519.13 | K | N/A | Daubert, Jalowka, et al., 1987 | Uncertainty assigned by TRC = 0.4 K; TRC |
Quantity | Value | Units | Method | Reference | Comment |
Pc | 41.85 | bar | N/A | Daubert, Jalowka, et al., 1987 | Uncertainty assigned by TRC = 0.09 bar; TRC |
Quantity | Value | Units | Method | Reference | Comment |
ΔvapH° | 37.2 ± 0.84 | kJ/mol | V | Vilcu and Perisanu, 1980 | ALS |
Enthalpy of vaporization
ΔvapH (kJ/mol) | Temperature (K) | Method | Reference | Comment |
---|---|---|---|---|
34.4 | 309. | A | Stephenson and Malanowski, 1987 | Based on data from 294. to 346. K. See also Dykyj, 1971, Capková and Fried, 1963, and Boublik, Fried, et al., 1984.; AC |
31.4 | 348. | N/A | Swamy and Van Winkle, 1965 | Based on data from 340. to 355. K.; AC |
Antoine Equation Parameters
log10(P) = A − (B / (T + C))
P = vapor pressure (bar)
T = temperature (K)
View plot Requires a JavaScript / HTML 5 canvas capable browser.
Temperature (K) | A | B | C | Reference | Comment |
---|---|---|---|---|---|
340. to 355. | 5.22841 | 1807.332 | 0.726 | Swamy and Van Winkle, 1965 | Coefficents calculated by NIST from author's data. |
294.98 to 345.19 | 4.34032 | 1299.069 | -46.183 | Capková and Fried, 1963 | Coefficents calculated by NIST from author's data. |
Enthalpy of fusion
ΔfusH (kJ/mol) | Temperature (K) | Reference | Comment |
---|---|---|---|
8.46 | 180.6 | Kulagina and Lebedev, 1997 | AC |

Reaction thermochemistry data

Data compiled by: Hussein Y. Afeefy, Joel F. Liebman, and Stephen E. Stein
Individual Reactions
By formula: C4H6O2 + H2 = C4H8O2
Quantity | Value | Units | Method | Reference | Comment |
---|---|---|---|---|---|
ΔrH° | -129. ± 4.6 | kJ/mol | Chyd | Vilcu and Perisanu, 1980 | liquid phase |
ΔrH° | -130.2 ± 0.3 | kJ/mol | Chyd | Dolliver, Gresham, et al., 1938, 2 | gas phase; At 355 °K |

Gas phase ion energetics data

Data evaluated as indicated in comments:
HL - Edward P. Hunter and Sharon G. Lias
L - Sharon G. Lias
Data compiled as indicated in comments:
LLK - Sharon G. Lias, Rhoda D. Levin, and Sherif A. Kafafi
RDSH - Henry M. Rosenstock, Keith Draxl, Bruce W. Steiner, and John T. Herron
LBLHLM - Sharon G. Lias, John E. Bartmess, Joel F. Liebman, John L. Holmes, Rhoda D. Levin, and W. Gary Mallard
Quantity | Value | Units | Method | Reference | Comment |
---|---|---|---|---|---|
IE (evaluated) | 9.2 | eV | N/A | N/A | L |
Quantity | Value | Units | Method | Reference | Comment |
Proton affinity (review) | 813.9 | kJ/mol | N/A | Hunter and Lias, 1998 | HL |
Quantity | Value | Units | Method | Reference | Comment |
Gas basicity | 782.9 | kJ/mol | N/A | Hunter and Lias, 1998 | HL |
Ionization energy determinations
IE (eV) | Method | Reference | Comment |
---|---|---|---|
9.2 | PE | Van Dam and Oskam, 1978 | LLK |
9.19 ± 0.05 | PI | Watanabe, Nakayama, et al., 1962 | RDSH |
9.85 | PE | Van Dam and Oskam, 1978 | Vertical value; LLK |
9.85 ± 0.05 | PE | Houk and Munchausen, 1976 | Vertical value; LLK |
Appearance energy determinations
Ion | AE (eV) | Other Products | Method | Reference | Comment |
---|---|---|---|---|---|
C2H3O+ | 10.04 ± 0.05 | C2H3O | EI | Holmes and Lossing, 1986 | LBLHLM |

Kovats' RI, non-polar column, isothermal

Column type | Active phase | Temperature (C) | I | Reference | Comment |
---|---|---|---|---|---|
Packed | SE-30 | 100. | 564. | Winskowski, 1983 | Gaschrom Q; Column length: 2. m |
Packed | Apiezon L | 120. | 527. | Bogoslovsky, Anvaer, et al., 1978 | Celite 545 |
Packed | Apiezon L | 160. | 529. | Bogoslovsky, Anvaer, et al., 1978 | Celite 545 |
Packed | SE-30 | 150. | 545. | Allen and Haken, 1970 | Celite 560 silanized; Column length: 3.7 m |
Packed | SE-30 | 150. | 548. | Germaine and Haken, 1969 | Celite 560; Column length: 3.7 m |

Normal alkane RI, non-polar column, isothermal

Column type | Active phase | Temperature (C) | I | Reference | Comment |
---|---|---|---|---|---|
Capillary | SE-30 | 120. | 524. | Gröbler and Bálizs, 1981 | |
Packed | Synachrom | 150. | 546. | Dufka, Malinsky, et al., 1971 | Helium, Synachrom (60-80 mesh); Column length: 1.5 m |
Packed | Synachrom | 150. | 551. | Dufka, Malinsky, et al., 1971 | Helium, Synachrom (60-80 mesh); Column length: 1.5 m |
Packed | DC-400 | 150. | 570. | Anderson, 1968 | Helium, Gas-Pak (60-80 mesh); Column length: 3.0 m |

Normal alkane RI, non-polar column, temperature ramp

Column type | Active phase | I | Reference | Comment |
---|---|---|---|---|
Capillary | OV-101 | 570. | Zenkevich, 2005 | 25. m/0.20 mm/0.10 μm, N2/He, 6. K/min; Tstart: 50. C; Tend: 250. C |
Capillary | BP-1 | 560. | Health Safety Executive, 2000 | 50. m/0.22 mm/0.75 μm, He, 5. K/min; Tstart: 50. C; Tend: 200. C |

Normal alkane RI, non-polar column, custom temperature program

Column type | Active phase | I | Reference | Comment |
---|---|---|---|---|
Capillary | SE-30 | 562. | Vinogradov, 2004 | Program: not specified |
Capillary | DB-1 | 562. | Ciccioli, Cecinato, et al., 1994 | 60. m/0.32 mm/0.25 μm; Program: not specified |
Capillary | DB-1 | 562. | Ciccioli, Brancaleoni, et al., 1993 | 60. m/0.32 mm/0.25 μm; Program: 3 min at 5 C; 5 - 50 C at 3 deg/min; 50 - 220 C at 5 deg/min |
Capillary | OV-1, SE-30, Methyl silicone, SP-2100, OV-101, DB-1, etc. | 548. | Waggott and Davies, 1984 | Hydrogen; Column length: 50. m; Column diameter: 0.32 mm; Program: not specified |
Capillary | OV-1, SE-30, Methyl silicone, SP-2100, OV-101, DB-1, etc. | 564. | Waggott and Davies, 1984 | Hydrogen; Column length: 50. m; Column diameter: 0.32 mm; Program: not specified |

Normal alkane RI, polar column, custom temperature program

Column type | Active phase | I | Reference | Comment |
---|---|---|---|---|
Capillary | Carbowax 20M | 878. | Vinogradov, 2004 | Program: not specified |

Henry's Law data

Data compiled by: Rolf Sander
Henry's Law constant (water solution)
kH(T) = k°H exp(d(ln(kH))/d(1/T) ((1/T) - 1/(298.15 K)))
k°H = Henry's law constant for solubility in water at 298.15 K (mol/(kg*bar))
d(ln(kH))/d(1/T) = Temperature dependence constant (K)
k°H (mol/(kg*bar)) | d(ln(kH))/d(1/T) (K) | Method | Reference |
---|---|---|---|
1.7 | 2600. | X | N/A |

References

Vilcu and Perisanu, 1980
Vilcu, R.; Perisanu, S.,
The ideal gas state enthalpies of formation of some monomers,
Rev. Roum. Chim., 1980, 25, 619-624. [all data]
Kudchadker S.A., 1975
Kudchadker S.A.,
Thermodynamic properties of oxygen compounds. I. Vinyl acetate,
Thermochim. Acta, 1975, 11, 361-365. [all data]
Bengough and Thomson, 1959
Bengough, W.I.; Thomson, R.A.M.,
A dilatometric method of measuring the heats of radiation-induced reactions. Part 2.- The heat of photochemical addition of bromotrichloromethane to vinyl acetate,
Trans. Faraday Soc., 1959, 55, 268-271. [all data]
Dolliver, Gresham, et al., 1938
Dolliver, M.A.; Gresham, T.L.; Kistiakowsky, G.B.; Smith, E.A.; Vaughan, W.E.,
Heats of Organic Reactions VI. Heats of Hydrogenation of Some Oxygen- Containing Compounds,
J. Am. Chem. Soc., 1938, 60, 440. [all data]
Daubert, Jalowka, et al., 1987
Daubert, T.E.; Jalowka, J.W.; Goren, V.,
Vapor pressure of 22 pure industrial chemicals,
AIChE Symp. Ser., 1987, 83, 256, 128-156. [all data]
Stephenson and Malanowski, 1987
Stephenson, Richard M.; Malanowski, Stanislaw,
Handbook of the Thermodynamics of Organic Compounds, 1987, https://doi.org/10.1007/978-94-009-3173-2
. [all data]
Dykyj, 1971
Dykyj, J.,
Petrochemia, 1971, 11, 2, 27. [all data]
Capková and Fried, 1963
Capková, A.; Fried, V.,
Gleichgewicht flüssigkeit-dampf XXX. System vinylacetat-essigsäure,
Collect. Czech. Chem. Commun., 1963, 28, 8, 2235-2239, https://doi.org/10.1135/cccc19632235
. [all data]
Boublik, Fried, et al., 1984
Boublik, T.; Fried, V.; Hala, E.,
The Vapour Pressures of Pure Substances: Selected Values of the Temperature Dependence of the Vapour Pressures of Some Pure Substances in the Normal and Low Pressure Region, 2nd ed., Elsevier, New York, 1984, 972. [all data]
Swamy and Van Winkle, 1965
Swamy, P.A.; Van Winkle, Matthew,
Vapor-Liquid Equilibria at 760 Mm. Mercury for the System Vinyl Acetate-2,4-Dimethyl Pentane.,
J. Chem. Eng. Data, 1965, 10, 3, 214-215, https://doi.org/10.1021/je60026a002
. [all data]
Kulagina and Lebedev, 1997
Kulagina, T.G.; Lebedev, B.V.,
Thermodynamic properties of vinyl acetate at 0-330 K,
Zh. Fiz. Khim., 1997, 71, 4, 601. [all data]
Dolliver, Gresham, et al., 1938, 2
Dolliver, M.A.; Gresham, T.L.; Kistiakowsky, G.B.; Smith, E.A.; Vaughan, W.E.,
Heats of organic reactions. VI. Heats of hydrogenation of some oxygen-containing compounds,
J. Am. Chem. Soc., 1938, 60, 440-450. [all data]
Hunter and Lias, 1998
Hunter, E.P.; Lias, S.G.,
Evaluated Gas Phase Basicities and Proton Affinities of Molecules: An Update,
J. Phys. Chem. Ref. Data, 1998, 27, 3, 413-656, https://doi.org/10.1063/1.556018
. [all data]
Van Dam and Oskam, 1978
Van Dam, H.; Oskam, A.,
He(I) and He(II) photoelectron spectra of some substituted ethylenes,
J. Electron Spectrosc. Relat. Phenom., 1978, 13, 273. [all data]
Watanabe, Nakayama, et al., 1962
Watanabe, K.; Nakayama, T.; Mottl, J.,
Ionization potentials of some molecules,
J. Quant. Spectry. Radiative Transfer, 1962, 2, 369. [all data]
Houk and Munchausen, 1976
Houk, K.N.; Munchausen, L.L.,
Ionization potentials, electron affinities, reactivities of cyanoalkenes related electron-deficient alkenes. A frontier molecular orbital treatment of cyanoalkene reactivities in cycloaddition, electrophilic, nucleophilic, and radical reactions.,
J. Am. Chem. Soc., 1976, 98, 937. [all data]
Holmes and Lossing, 1986
Holmes, J.L.; Lossing, F.P.,
Heats of formation and homolytic bond dissociation energies in the keto-enol tautomers C2H4O, C3H6O,
J. Am. Chem. Soc., 1986, 108, 1086. [all data]
Winskowski, 1983
Winskowski, J.,
Gaschromatographische Identifizierung von Stoffen anhand von Indexziffem und unterschiedlichen Detektoren,
Chromatographia, 1983, 17, 3, 160-165, https://doi.org/10.1007/BF02271041
. [all data]
Bogoslovsky, Anvaer, et al., 1978
Bogoslovsky, Yu.N.; Anvaer, B.I.; Vigdergauz, M.S.,
Chromatographic constants in gas chromatography (in Russian), Standards Publ. House, Moscow, 1978, 192. [all data]
Allen and Haken, 1970
Allen, I.D.; Haken, J.K.,
Gas chromatography of homologous esters. Part IV. Influence of stationary phase polarity on retention of unsaturated esters,
J. Chromatogr., 1970, 51, 415-422, https://doi.org/10.1016/S0021-9673(01)96890-6
. [all data]
Germaine and Haken, 1969
Germaine, R.W.; Haken, J.K.,
Gas chromatography of homologous esters. Part 2. Unsaturated esters,
J. Chromatogr., 1969, 43, 43-47, https://doi.org/10.1016/S0021-9673(00)99163-5
. [all data]
Gröbler and Bálizs, 1981
Gröbler, A.; Bálizs, G.,
Investigations on mixed gas chromatographic stationary phases. Part 3: A generalized approximation of retention indices for polar-nonpoalar stationary phase mixtures,
J. Chromatogr. Sci., 1981, 19, 1, 46-51, https://doi.org/10.1093/chromsci/19.1.46
. [all data]
Dufka, Malinsky, et al., 1971
Dufka, O.; Malinsky, J.; Vladyka, J.,
Sorpcni materialy pro plynovou chromatographii - III,
Chemicky promysl., 1971, 21/46, 9, 459-463. [all data]
Anderson, 1968
Anderson, D.G.,
USe of Kovats retention indices and response factors for the qualitative and quantitative analysis of coating solvents,
J. Paint Technol., 1968, 40, 527, 549-557. [all data]
Zenkevich, 2005
Zenkevich, I.G.,
Experimentally measured retention indices., 2005. [all data]
Health Safety Executive, 2000
Health Safety Executive,
MDHS 96 Volatile organic compounds in air - Laboratory method using pumed solid sorbent tubes, solvent desorption and gas chromatography
in Methods for the Determination of Hazardous Substances (MDHS) guidance, Crown, Colegate, Norwich, 2000, 1-24, retrieved from http://www.hse.gov.uk/pubns/mdhs/pdfs/mdhs96.pdf. [all data]
Vinogradov, 2004
Vinogradov, B.A.,
Production, composition, properties and application of essential oils, 2004, retrieved from http://viness.narod.ru. [all data]
Ciccioli, Cecinato, et al., 1994
Ciccioli, P.; Cecinato, A.; Brancaleoni, E.; Brachetti, A.; Frattoni, M.; Sparapani, R.,
Composition and Distribution of Polar and Non-Polar VOCs in Urban, Rural, Forest and Remote Areas,
Eur Commission EUR, 1994, 549-568. [all data]
Ciccioli, Brancaleoni, et al., 1993
Ciccioli, P.; Brancaleoni, E.; Cecinato, A.; Sparapani, R.; Frattoni, M.,
Identification and determination of biogenic and anthropogenic volatile organic compounds in forest areas of Northern and Southern Europe and a remote site of the Himalaya region by high-resolution gas chromatography-mass spectrometry,
J. Chromatogr., 1993, 643, 1-2, 55-69, https://doi.org/10.1016/0021-9673(93)80541-F
. [all data]
Waggott and Davies, 1984
Waggott, A.; Davies, I.W.,
Identification of organic pollutants using linear temperature programmed retention indices (LTPRIs) - Part II, 1984, retrieved from http://dwi.defra.gov.uk/research/completed-research/reports/dwi0383.pdf. [all data]